{"text_format":"1","workbook":"xlsx","n_sheets":5,"sheets":["22 Pistol","22 Rifle","SortSheet","for HTML","Lists"],"not_rendered":{"charts":0,"images":0,"macros":1,"external_links":1,"defined_names":13,"comments":0,"pivot_tables":2},"unopened":[],"bounds":{"document_bytes":16777216,"sheet_cells":100000,"rows_first":2000,"rows_last":500,"rows_between":2000,"halvings":0,"cell_chars":16384,"cell_head_chars":4096},"cells_cut":0,"cells_raw":0,"read":"whole","date_system":"1900"}

{"sheet":"22 Pistol","index":0,"n_rows":43,"n_cols":24,"rows_kept":43,"cut":false,"hidden":false,"merged":[[0,23,0,24],[0,20,0,21],[1,8,1,13],[1,14,1,19],[0,5,0,6],[0,7,0,16],[1,5,1,7]]}
[null,null,".22 Pistol",null,{"$f":"SUM($E$5:$E$43)","v":0},"DATE",null,"Country Pond Fish & Game Club\n.22 RIMFIRE Pin Shoot",null,null,null,null,null,null,null,null,null,null,null,null,"2017-05-29T07:26:39",null,null,"=LastSaved()"]
[null,null,null,null,null,"GUN",null,null,"RELAY 1",null,null,null,null,null,"RELAY 2"]
[]
[null,null,"NAME","CPF&G #","PAID","MANUFACTURER","MODEL","SIGHTS","LN1","SCORE1","LN2","SCORE2","LN3","SCORE3","LN4","SCORE4","LN5","SCORE5","LN6","SCORE6","TOTAL","SHOOTOFF"]
[1,null,null,null,null,null,null,null,1,null,2,null,3,null,1,null,2,null,3,null,{"$f":"IF($C5=\"\",0,IF(J5+L5+N5+P5+R5+T5=0,\"\",J5+L5+N5+P5+R5+T5))","v":0},null,null,{"$f":"IFERROR(VLOOKUP(C5,#REF!,1,0),\"\")","v":""}]
[2,null,null,null,null,null,null,null,2,null,3,null,1,null,2,null,3,null,1,null,0,null,null,{"$f":"IFERROR(VLOOKUP(C6,#REF!,1,0),\"\")","v":""}]
[3,null,null,null,null,null,null,null,3,null,1,null,2,null,3,null,1,null,2,null,0,null,null,{"$f":"IFERROR(VLOOKUP(C7,#REF!,1,0),\"\")","v":""}]
[4,null,null,null,null,null,null,null,1,null,2,null,3,null,1,null,2,null,3,null,0,null,null,{"$f":"IFERROR(VLOOKUP(C8,#REF!,1,0),\"\")","v":""}]
[5,null,null,null,null,null,null,null,2,null,3,null,1,null,2,null,3,null,1,null,0,null,null,{"$f":"IFERROR(VLOOKUP(C9,#REF!,1,0),\"\")","v":""}]
[6,null,null,null,null,null,null,null,3,null,1,null,2,null,3,null,1,null,2,null,0,null,null,{"$f":"IFERROR(VLOOKUP(C10,#REF!,1,0),\"\")","v":""}]
{"$rows_left_out":34}
{"sheet":"22 Rifle","index":1,"n_rows":43,"n_cols":24,"rows_kept":43,"cut":false,"hidden":false,"merged":[[1,5,1,6],[1,8,1,13],[1,14,1,19],[0,5,0,6],[0,7,0,20]]}
[null,null,".22 Rifle",null,{"$f":"SUM($E$5:$E$43)","v":0},{"$f":"'22 Pistol'!F1:G1","v":"DATE"},null,"Country Pond Fish & Game Club\n.22 Rimfire Pin Shoot"]
[null,null,null,null,null,"GUN",null,null,"RELAY 1",null,null,null,null,null,"RELAY 2"]
[]
[null,null,"NAME","CPF&G #","PAID","MANUFACTURER","MODEL","SIGHTS","LN","SCORE","LN2","SCORE3","LN4","SCORE5","LN6","SCORE7","LN8","SCORE9","LN10","SCORE11","TOTAL","SHOOTOFF"]
[1,null,null,null,null,null,null,null,1,null,2,null,3,null,1,null,2,null,3,null,{"$f":"IF($C5=\"\",0,IF(J5+L5+N5+P5+R5+T5=0,\"\",J5+L5+N5+P5+R5+T5))","v":0},null,null,{"$f":"IFERROR(VLOOKUP(C5,#REF!,1,0),\"\")","v":""}]
[2,null,null,null,null,null,null,null,2,null,3,null,1,null,2,null,3,null,1,null,0,null,null,{"$f":"IFERROR(VLOOKUP(C6,#REF!,1,0),\"\")","v":""}]
[3,null,null,null,null,null,null,null,3,null,1,null,2,null,3,null,1,null,2,null,0,null,null,{"$f":"IFERROR(VLOOKUP(C7,#REF!,1,0),\"\")","v":""}]
[4,null,null,null,null,null,null,null,1,null,2,null,3,null,1,null,2,null,3,null,0,null,null,{"$f":"IFERROR(VLOOKUP(C8,#REF!,1,0),\"\")","v":""}]
[5,null,null,null,null,null,null,null,2,null,3,null,1,null,2,null,3,null,1,null,0,null,null,{"$f":"IFERROR(VLOOKUP(C9,#REF!,1,0),\"\")","v":""}]
[6,null,null,null,null,null,null,null,3,null,1,null,2,null,3,null,1,null,2,null,0,null,null,{"$f":"IFERROR(VLOOKUP(C10,#REF!,1,0),\"\")","v":""}]
{"$rows_left_out":34}
{"sheet":"SortSheet","index":2,"n_rows":43,"n_cols":29,"rows_kept":43,"cut":false,"hidden":true,"merged":[[1,1,1,13],[1,16,1,28],[2,18,2,20],[2,21,2,23],[2,24,2,26],[2,3,2,5],[2,6,2,8],[2,9,2,11]]}
[null,"To SORT SCORES, first sort SHOOTOFF column: SMALL to LARGE, then SCORE column: LARGE to SMALL."]
[null,"PISTOL",null,null,null,null,null,null,null,null,null,null,null,null,null,null,"RIFLE"]
[null,null,null,"GUN",null,null,"RELAY 1",null,null,"RELAY 2",null,null,null,null,null,null,null,null,"GUN",null,null,"RELAY 1",null,null,"RELAY 2"]
["#","SHOOTER","CPF&G #","MFR","MODEL","SIGHTS","1","2","3","12","23","34","SCORE","SHOOT\nOFF",null,"#","SHOOTER","CPF&G #","MFR","MODEL","SIGHTS","1","2","3","12","23","34","SCORE","SHOOT\nOFF"]
[1,{"$f":"IF('22 Pistol'!$C5=\"\",\"\",'22 Pistol'!C5)","v":""},{"$f":"IF('22 Pistol'!$D5=\"\",\"\",'22 Pistol'!D5)","v":""},{"$f":"IF('22 Pistol'!$C5=\"\",\"\",'22 Pistol'!F5)","v":""},{"$f":"IF('22 Pistol'!$C5=\"\",\"\",'22 Pistol'!G5)","v":""},{"$f":"IF('22 Pistol'!$C5=\"\",\"\",'22 Pistol'!H5)","v":""},{"$f":"IF('22 Pistol'!$C5=\"\",\"\",'22 Pistol'!J5)","v":""},{"$f":"IF('22 Pistol'!$C5=\"\",\"\",'22 Pistol'!L5)","v":""},{"$f":"IF('22 Pistol'!$C5=\"\",\"\",'22 Pistol'!N5)","v":""},{"$f":"IF('22 Pistol'!$C5=\"\",\"\",'22 Pistol'!P5)","v":""},{"$f":"IF('22 Pistol'!$C5=\"\",\"\",'22 Pistol'!R5)","v":""},{"$f":"IF('22 Pistol'!$C5=\"\",\"\",'22 Pistol'!T5)","v":""},{"$f":"IF('22 Pistol'!$C5=\"\",0,'22 Pistol'!U5)","v":0},{"$f":"IF('22 Pistol'!$C5=\"\",0,'22 Pistol'!V5)","v":0},null,1,{"$f":"IF('22 Rifle'!$C5=\"\",\"\",'22 Rifle'!C5)","v":""},{"$f":"IF('22 Rifle'!$D5=\"\",\"\",'22 Rifle'!D5)","v":""},{"$f":"IF('22 Rifle'!$C5=\"\",\"\",'22 Rifle'!F5)","v":""},{"$f":"IF('22 Rifle'!$C5=\"\",\"\",'22 Rifle'!G5)","v":""},{"$f":"IF('22 Rifle'!$C5=\"\",\"\",'22 Rifle'!H5)","v":""},{"$f":"IF('22 Rifle'!$C5=\"\",\"\",'22 Rifle'!J5)","v":""},{"$f":"IF('22 Rifle'!$C5=\"\",\"\",'22 Rifle'!L5)","v":""},{"$f":"IF('22 Rifle'!$C5=\"\",\"\",'22 Rifle'!N5)","v":""},{"$f":"IF('22 Rifle'!$C5=\"\",\"\",'22 Rifle'!P5)","v":""},{"$f":"IF('22 Rifle'!$C5=\"\",\"\",'22 Rifle'!R5)","v":""},{"$f":"IF('22 Rifle'!$C5=\"\",\"\",'22 Rifle'!T5)","v":""},{"$f":"IF('22 Rifle'!$C5=\"\",0,'22 Rifle'!U5)","v":0},{"$f":"IF('22 Rifle'!$C5=\"\",0,'22 Rifle'!V5)","v":0}]
[2,{"$f":"IF('22 Pistol'!$C6=\"\",\"\",'22 Pistol'!C6)","v":""},{"$f":"IF('22 Pistol'!$D6=\"\",\"\",'22 Pistol'!D6)","v":""},{"$f":"IF('22 Pistol'!$C6=\"\",\"\",'22 Pistol'!F6)","v":""},{"$f":"IF('22 Pistol'!$C6=\"\",\"\",'22 Pistol'!G6)","v":""},{"$f":"IF('22 Pistol'!$C6=\"\",\"\",'22 Pistol'!H6)","v":""},{"$f":"IF('22 Pistol'!$C6=\"\",\"\",'22 Pistol'!J6)","v":""},{"$f":"IF('22 Pistol'!$C6=\"\",\"\",'22 Pistol'!L6)","v":""},{"$f":"IF('22 Pistol'!$C6=\"\",\"\",'22 Pistol'!N6)","v":""},{"$f":"IF('22 Pistol'!$C6=\"\",\"\",'22 Pistol'!P6)","v":""},{"$f":"IF('22 Pistol'!$C6=\"\",\"\",'22 Pistol'!R6)","v":""},{"$f":"IF('22 Pistol'!$C6=\"\",\"\",'22 Pistol'!T6)","v":""},{"$f":"IF($B6=\"\",0,'22 Pistol'!U6)","v":0},{"$f":"IF('22 Pistol'!$C6=\"\",0,'22 Pistol'!V6)","v":0},null,2,{"$f":"IF('22 Rifle'!$C6=\"\",\"\",'22 Rifle'!C6)","v":""},{"$f":"IF('22 Rifle'!$D6=\"\",\"\",'22 Rifle'!D6)","v":""},{"$f":"IF('22 Rifle'!$C6=\"\",\"\",'22 Rifle'!F6)","v":""},{"$f":"IF('22 Rifle'!$C6=\"\",\"\",'22 Rifle'!G6)","v":""},{"$f":"IF('22 Rifle'!$C6=\"\",\"\",'22 Rifle'!H6)","v":""},{"$f":"IF('22 Rifle'!$C6=\"\",\"\",'22 Rifle'!J6)","v":""},{"$f":"IF('22 Rifle'!$C6=\"\",\"\",'22 Rifle'!L6)","v":""},{"$f":"IF('22 Rifle'!$C6=\"\",\"\",'22 Rifle'!N6)","v":""},{"$f":"IF('22 Rifle'!$C6=\"\",\"\",'22 Rifle'!P6)","v":""},{"$f":"IF('22 Rifle'!$C6=\"\",\"\",'22 Rifle'!R6)","v":""},{"$f":"IF('22 Rifle'!$C6=\"\",\"\",'22 Rifle'!T6)","v":""},{"$f":"IF('22 Rifle'!$C6=\"\",0,'22 Rifle'!U6)","v":0},{"$f":"IF('22 Rifle'!$C6=\"\",0,'22 Rifle'!V6)","v":0}]
[3,{"$f":"IF('22 Pistol'!$C7=\"\",\"\",'22 Pistol'!C7)","v":""},{"$f":"IF('22 Pistol'!$D7=\"\",\"\",'22 Pistol'!D7)","v":""},{"$f":"IF('22 Pistol'!$C7=\"\",\"\",'22 Pistol'!F7)","v":""},{"$f":"IF('22 Pistol'!$C7=\"\",\"\",'22 Pistol'!G7)","v":""},{"$f":"IF('22 Pistol'!$C7=\"\",\"\",'22 Pistol'!H7)","v":""},{"$f":"IF('22 Pistol'!$C7=\"\",\"\",'22 Pistol'!J7)","v":""},{"$f":"IF('22 Pistol'!$C7=\"\",\"\",'22 Pistol'!L7)","v":""},{"$f":"IF('22 Pistol'!$C7=\"\",\"\",'22 Pistol'!N7)","v":""},{"$f":"IF('22 Pistol'!$C7=\"\",\"\",'22 Pistol'!P7)","v":""},{"$f":"IF('22 Pistol'!$C7=\"\",\"\",'22 Pistol'!R7)","v":""},{"$f":"IF('22 Pistol'!$C7=\"\",\"\",'22 Pistol'!T7)","v":""},{"$f":"IF($B7=\"\",0,'22 Pistol'!U7)","v":0},{"$f":"IF('22 Pistol'!$C7=\"\",0,'22 Pistol'!V7)","v":0},null,3,{"$f":"IF('22 Rifle'!$C7=\"\",\"\",'22 Rifle'!C7)","v":""},{"$f":"IF('22 Rifle'!$D7=\"\",\"\",'22 Rifle'!D7)","v":""},{"$f":"IF('22 Rifle'!$C7=\"\",\"\",'22 Rifle'!F7)","v":""},{"$f":"IF('22 Rifle'!$C7=\"\",\"\",'22 Rifle'!G7)","v":""},{"$f":"IF('22 Rifle'!$C7=\"\",\"\",'22 Rifle'!H7)","v":""},{"$f":"IF('22 Rifle'!$C7=\"\",\"\",'22 Rifle'!J7)","v":""},{"$f":"IF('22 Rifle'!$C7=\"\",\"\",'22 Rifle'!L7)","v":""},{"$f":"IF('22 Rifle'!$C7=\"\",\"\",'22 Rifle'!N7)","v":""},{"$f":"IF('22 Rifle'!$C7=\"\",\"\",'22 Rifle'!P7)","v":""},{"$f":"IF('22 Rifle'!$C7=\"\",\"\",'22 Rifle'!R7)","v":""},{"$f":"IF('22 Rifle'!$C7=\"\",\"\",'22 Rifle'!T7)","v":""},{"$f":"IF('22 Rifle'!$C7=\"\",0,'22 Rifle'!U7)","v":0},{"$f":"IF('22 Rifle'!$C7=\"\",0,'22 Rifle'!V7)","v":0}]
[4,{"$f":"IF('22 Pistol'!$C8=\"\",\"\",'22 Pistol'!C8)","v":""},{"$f":"IF('22 Pistol'!$D8=\"\",\"\",'22 Pistol'!D8)","v":""},{"$f":"IF('22 Pistol'!$C8=\"\",\"\",'22 Pistol'!F8)","v":""},{"$f":"IF('22 Pistol'!$C8=\"\",\"\",'22 Pistol'!G8)","v":""},{"$f":"IF('22 Pistol'!$C8=\"\",\"\",'22 Pistol'!H8)","v":""},{"$f":"IF('22 Pistol'!$C8=\"\",\"\",'22 Pistol'!J8)","v":""},{"$f":"IF('22 Pistol'!$C8=\"\",\"\",'22 Pistol'!L8)","v":""},{"$f":"IF('22 Pistol'!$C8=\"\",\"\",'22 Pistol'!N8)","v":""},{"$f":"IF('22 Pistol'!$C8=\"\",\"\",'22 Pistol'!P8)","v":""},{"$f":"IF('22 Pistol'!$C8=\"\",\"\",'22 Pistol'!R8)","v":""},{"$f":"IF('22 Pistol'!$C8=\"\",\"\",'22 Pistol'!T8)","v":""},{"$f":"IF($B8=\"\",0,'22 Pistol'!U8)","v":0},{"$f":"IF('22 Pistol'!$C8=\"\",0,'22 Pistol'!V8)","v":0},null,4,{"$f":"IF('22 Rifle'!$C8=\"\",\"\",'22 Rifle'!C8)","v":""},{"$f":"IF('22 Rifle'!$D8=\"\",\"\",'22 Rifle'!D8)","v":""},{"$f":"IF('22 Rifle'!$C8=\"\",\"\",'22 Rifle'!F8)","v":""},{"$f":"IF('22 Rifle'!$C8=\"\",\"\",'22 Rifle'!G8)","v":""},{"$f":"IF('22 Rifle'!$C8=\"\",\"\",'22 Rifle'!H8)","v":""},{"$f":"IF('22 Rifle'!$C8=\"\",\"\",'22 Rifle'!J8)","v":""},{"$f":"IF('22 Rifle'!$C8=\"\",\"\",'22 Rifle'!L8)","v":""},{"$f":"IF('22 Rifle'!$C8=\"\",\"\",'22 Rifle'!N8)","v":""},{"$f":"IF('22 Rifle'!$C8=\"\",\"\",'22 Rifle'!P8)","v":""},{"$f":"IF('22 Rifle'!$C8=\"\",\"\",'22 Rifle'!R8)","v":""},{"$f":"IF('22 Rifle'!$C8=\"\",\"\",'22 Rifle'!T8)","v":""},{"$f":"IF('22 Rifle'!$C8=\"\",0,'22 Rifle'!U8)","v":0},{"$f":"IF('22 Rifle'!$C8=\"\",0,'22 Rifle'!V8)","v":0}]
[5,{"$f":"IF('22 Pistol'!$C9=\"\",\"\",'22 Pistol'!C9)","v":""},{"$f":"IF('22 Pistol'!$D9=\"\",\"\",'22 Pistol'!D9)","v":""},{"$f":"IF('22 Pistol'!$C9=\"\",\"\",'22 Pistol'!F9)","v":""},{"$f":"IF('22 Pistol'!$C9=\"\",\"\",'22 Pistol'!G9)","v":""},{"$f":"IF('22 Pistol'!$C9=\"\",\"\",'22 Pistol'!H9)","v":""},{"$f":"IF('22 Pistol'!$C9=\"\",\"\",'22 Pistol'!J9)","v":""},{"$f":"IF('22 Pistol'!$C9=\"\",\"\",'22 Pistol'!L9)","v":""},{"$f":"IF('22 Pistol'!$C9=\"\",\"\",'22 Pistol'!N9)","v":""},{"$f":"IF('22 Pistol'!$C9=\"\",\"\",'22 Pistol'!P9)","v":""},{"$f":"IF('22 Pistol'!$C9=\"\",\"\",'22 Pistol'!R9)","v":""},{"$f":"IF('22 Pistol'!$C9=\"\",\"\",'22 Pistol'!T9)","v":""},{"$f":"IF($B9=\"\",0,'22 Pistol'!U9)","v":0},{"$f":"IF('22 Pistol'!$C9=\"\",0,'22 Pistol'!V9)","v":0},null,5,{"$f":"IF('22 Rifle'!$C9=\"\",\"\",'22 Rifle'!C9)","v":""},{"$f":"IF('22 Rifle'!$D9=\"\",\"\",'22 Rifle'!D9)","v":""},{"$f":"IF('22 Rifle'!$C9=\"\",\"\",'22 Rifle'!F9)","v":""},{"$f":"IF('22 Rifle'!$C9=\"\",\"\",'22 Rifle'!G9)","v":""},{"$f":"IF('22 Rifle'!$C9=\"\",\"\",'22 Rifle'!H9)","v":""},{"$f":"IF('22 Rifle'!$C9=\"\",\"\",'22 Rifle'!J9)","v":""},{"$f":"IF('22 Rifle'!$C9=\"\",\"\",'22 Rifle'!L9)","v":""},{"$f":"IF('22 Rifle'!$C9=\"\",\"\",'22 Rifle'!N9)","v":""},{"$f":"IF('22 Rifle'!$C9=\"\",\"\",'22 Rifle'!P9)","v":""},{"$f":"IF('22 Rifle'!$C9=\"\",\"\",'22 Rifle'!R9)","v":""},{"$f":"IF('22 Rifle'!$C9=\"\",\"\",'22 Rifle'!T9)","v":""},{"$f":"IF('22 Rifle'!$C9=\"\",0,'22 Rifle'!U9)","v":0},{"$f":"IF('22 Rifle'!$C9=\"\",0,'22 Rifle'!V9)","v":0}]
[6,{"$f":"IF('22 Pistol'!$C10=\"\",\"\",'22 Pistol'!C10)","v":""},{"$f":"IF('22 Pistol'!$D10=\"\",\"\",'22 Pistol'!D10)","v":""},{"$f":"IF('22 Pistol'!$C10=\"\",\"\",'22 Pistol'!F10)","v":""},{"$f":"IF('22 Pistol'!$C10=\"\",\"\",'22 Pistol'!G10)","v":""},{"$f":"IF('22 Pistol'!$C10=\"\",\"\",'22 Pistol'!H10)","v":""},{"$f":"IF('22 Pistol'!$C10=\"\",\"\",'22 Pistol'!J10)","v":""},{"$f":"IF('22 Pistol'!$C10=\"\",\"\",'22 Pistol'!L10)","v":""},{"$f":"IF('22 Pistol'!$C10=\"\",\"\",'22 Pistol'!N10)","v":""},{"$f":"IF('22 Pistol'!$C10=\"\",\"\",'22 Pistol'!P10)","v":""},{"$f":"IF('22 Pistol'!$C10=\"\",\"\",'22 Pistol'!R10)","v":""},{"$f":"IF('22 Pistol'!$C10=\"\",\"\",'22 Pistol'!T10)","v":""},{"$f":"IF($B10=\"\",0,'22 Pistol'!U10)","v":0},{"$f":"IF('22 Pistol'!$C10=\"\",0,'22 Pistol'!V10)","v":0},null,6,{"$f":"IF('22 Rifle'!$C10=\"\",\"\",'22 Rifle'!C10)","v":""},{"$f":"IF('22 Rifle'!$D10=\"\",\"\",'22 Rifle'!D10)","v":""},{"$f":"IF('22 Rifle'!$C10=\"\",\"\",'22 Rifle'!F10)","v":""},{"$f":"IF('22 Rifle'!$C10=\"\",\"\",'22 Rifle'!G10)","v":""},{"$f":"IF('22 Rifle'!$C10=\"\",\"\",'22 Rifle'!H10)","v":""},{"$f":"IF('22 Rifle'!$C10=\"\",\"\",'22 Rifle'!J10)","v":""},{"$f":"IF('22 Rifle'!$C10=\"\",\"\",'22 Rifle'!L10)","v":""},{"$f":"IF('22 Rifle'!$C10=\"\",\"\",'22 Rifle'!N10)","v":""},{"$f":"IF('22 Rifle'!$C10=\"\",\"\",'22 Rifle'!P10)","v":""},{"$f":"IF('22 Rifle'!$C10=\"\",\"\",'22 Rifle'!R10)","v":""},{"$f":"IF('22 Rifle'!$C10=\"\",\"\",'22 Rifle'!T10)","v":""},{"$f":"IF('22 Rifle'!$C10=\"\",0,'22 Rifle'!U10)","v":0},{"$f":"IF('22 Rifle'!$C10=\"\",0,'22 Rifle'!V10)","v":0}]
{"$rows_left_out":34}
{"sheet":"for HTML","index":3,"n_rows":64,"n_cols":21,"rows_kept":64,"cut":false,"hidden":true,"merged":[]}
[{"$f":"'22 Pistol'!F1","v":"DATE"},"NAME",null,"GUN",null,1,null,2,null,3,null,4,null,5,null,6,null,"TTL",null,null,"SO"]
["22 PISTOL"]
["<tr align=\"center\">###<td class=\"Bld\">",{"$f":"IF(SortSheet!B5=\"\",\"\",SortSheet!B5)","v":""},"</td>###<td>",{"$f":"IF(SortSheet!$B5=\"\",\"\",CONCATENATE(SortSheet!$D5,\" \",SortSheet!$E5,\", \",SortSheet!$F5))","v":""},{"$f":"IF(F3=6,\"</td>###<td class='ClnPos'>\",\"</td>###<td>\")","v":"</td>###<td>"},{"$f":"IF(SortSheet!G5=\"\",\"\",SortSheet!G5)","v":""},{"$f":"IF(H3=6,\"</td><td class='ClnPos'>\",\"</td><td>\")","v":"</td><td>"},{"$f":"IF(SortSheet!H5=\"\",\"\",SortSheet!H5)","v":""},{"$f":"IF(J3=6,\"</td><td class='ClnPos'>\",\"</td><td>\")","v":"</td><td>"},{"$f":"IF(SortSheet!I5=\"\",\"\",SortSheet!I5)","v":""},{"$f":"IF(L3=6,\"</td><td class='ClnPos'>\",\"</td><td>\")","v":"</td><td>"},{"$f":"IF(SortSheet!J5=\"\",\"\",SortSheet!J5)","v":""},{"$f":"IF(N3=6,\"</td><td class='ClnPos'>\",\"</td><td>\")","v":"</td><td>"},{"$f":"IF(SortSheet!K5=\"\",\"\",SortSheet!K5)","v":""},{"$f":"IF(P3=6,\"</td><td class='ClnPos'>\",\"</td><td>\")","v":"</td><td>"},{"$f":"IF(SortSheet!L5=\"\",\"\",SortSheet!L5)","v":""},{"$f":"IF(R3=36,\"</td><td class='ClnMatch'>\",\"</td><td class='Bld'>\")","v":"</td><td class='Bld'>"},{"$f":"IF(SortSheet!M5=0,\"\",SortSheet!M5)","v":""},"</td>###<td class='Bld'>",{"$f":"IF(SortSheet!N5=0,\"\",SortSheet!N5)","v":""},"</td>###</tr>"]
["<tr align=\"center\">###<td class=\"Bld\">",{"$f":"IF(SortSheet!B6=\"\",\"\",SortSheet!B6)","v":""},"</td>###<td>",{"$f":"IF(SortSheet!$B6=\"\",\"\",CONCATENATE(SortSheet!$D6,\" \",SortSheet!$E6,\", \",SortSheet!$F6))","v":""},"</td>###<td>",{"$f":"IF(SortSheet!G6=\"\",\"\",SortSheet!G6)","v":""},"</td><td>",{"$f":"IF(SortSheet!H6=\"\",\"\",SortSheet!H6)","v":""},"</td><td>",{"$f":"IF(SortSheet!I6=\"\",\"\",SortSheet!I6)","v":""},"</td><td>",{"$f":"IF(SortSheet!J6=\"\",\"\",SortSheet!J6)","v":""},"</td><td>",{"$f":"IF(SortSheet!K6=\"\",\"\",SortSheet!K6)","v":""},"</td><td>",{"$f":"IF(SortSheet!L6=\"\",\"\",SortSheet!L6)","v":""},"</td><td class='Bld'>",{"$f":"IF(SortSheet!M6=0,\"\",SortSheet!M6)","v":""},"</td>###<td class='Bld'>",{"$f":"IF(SortSheet!N6=0,\"\",SortSheet!N6)","v":""},"</td>###</tr>"]
["<tr align=\"center\">###<td class=\"Bld\">",{"$f":"IF(SortSheet!B7=\"\",\"\",SortSheet!B7)","v":""},"</td>###<td>",{"$f":"IF(SortSheet!$B7=\"\",\"\",CONCATENATE(SortSheet!$D7,\" \",SortSheet!$E7,\", \",SortSheet!$F7))","v":""},"</td>###<td>",{"$f":"IF(SortSheet!G7=\"\",\"\",SortSheet!G7)","v":""},"</td><td>",{"$f":"IF(SortSheet!H7=\"\",\"\",SortSheet!H7)","v":""},"</td><td>",{"$f":"IF(SortSheet!I7=\"\",\"\",SortSheet!I7)","v":""},"</td><td>",{"$f":"IF(SortSheet!J7=\"\",\"\",SortSheet!J7)","v":""},"</td><td>",{"$f":"IF(SortSheet!K7=\"\",\"\",SortSheet!K7)","v":""},"</td><td>",{"$f":"IF(SortSheet!L7=\"\",\"\",SortSheet!L7)","v":""},"</td><td class='Bld'>",{"$f":"IF(SortSheet!M7=0,\"\",SortSheet!M7)","v":""},"</td>###<td class='Bld'>",{"$f":"IF(SortSheet!N7=0,\"\",SortSheet!N7)","v":""},"</td>###</tr>"]
["<tr align=\"center\">###<td class=\"Bld\">",{"$f":"IF(SortSheet!B8=\"\",\"\",SortSheet!B8)","v":""},"</td>###<td>",{"$f":"IF(SortSheet!$B8=\"\",\"\",CONCATENATE(SortSheet!$D8,\" \",SortSheet!$E8,\", \",SortSheet!$F8))","v":""},"</td>###<td>",{"$f":"IF(SortSheet!G8=\"\",\"\",SortSheet!G8)","v":""},"</td><td>",{"$f":"IF(SortSheet!H8=\"\",\"\",SortSheet!H8)","v":""},"</td><td>",{"$f":"IF(SortSheet!I8=\"\",\"\",SortSheet!I8)","v":""},"</td><td>",{"$f":"IF(SortSheet!J8=\"\",\"\",SortSheet!J8)","v":""},"</td><td>",{"$f":"IF(SortSheet!K8=\"\",\"\",SortSheet!K8)","v":""},"</td><td>",{"$f":"IF(SortSheet!L8=\"\",\"\",SortSheet!L8)","v":""},"</td><td class='Bld'>",{"$f":"IF(SortSheet!M8=0,\"\",SortSheet!M8)","v":""},"</td>###<td class='Bld'>",{"$f":"IF(SortSheet!N8=0,\"\",SortSheet!N8)","v":""},"</td>###</tr>"]
["<tr align=\"center\">###<td class=\"Bld\">",{"$f":"IF(SortSheet!B9=\"\",\"\",SortSheet!B9)","v":""},"</td>###<td>",{"$f":"IF(SortSheet!$B9=\"\",\"\",CONCATENATE(SortSheet!$D9,\" \",SortSheet!$E9,\", \",SortSheet!$F9))","v":""},"</td>###<td>",{"$f":"IF(SortSheet!G9=\"\",\"\",SortSheet!G9)","v":""},"</td><td>",{"$f":"IF(SortSheet!H9=\"\",\"\",SortSheet!H9)","v":""},"</td><td>",{"$f":"IF(SortSheet!I9=\"\",\"\",SortSheet!I9)","v":""},"</td><td>",{"$f":"IF(SortSheet!J9=\"\",\"\",SortSheet!J9)","v":""},"</td><td>",{"$f":"IF(SortSheet!K9=\"\",\"\",SortSheet!K9)","v":""},"</td><td>",{"$f":"IF(SortSheet!L9=\"\",\"\",SortSheet!L9)","v":""},"</td><td class='Bld'>",{"$f":"IF(SortSheet!M9=0,\"\",SortSheet!M9)","v":""},"</td>###<td class='Bld'>",{"$f":"IF(SortSheet!N9=0,\"\",SortSheet!N9)","v":""},"</td>###</tr>"]
["<tr align=\"center\">###<td class=\"Bld\">",{"$f":"IF(SortSheet!B10=\"\",\"\",SortSheet!B10)","v":""},"</td>###<td>",{"$f":"IF(SortSheet!$B10=\"\",\"\",CONCATENATE(SortSheet!$D10,\" \",SortSheet!$E10,\", \",SortSheet!$F10))","v":""},"</td>###<td>",{"$f":"IF(SortSheet!G10=\"\",\"\",SortSheet!G10)","v":""},"</td><td>",{"$f":"IF(SortSheet!H10=\"\",\"\",SortSheet!H10)","v":""},"</td><td>",{"$f":"IF(SortSheet!I10=\"\",\"\",SortSheet!I10)","v":""},"</td><td>",{"$f":"IF(SortSheet!J10=\"\",\"\",SortSheet!J10)","v":""},"</td><td>",{"$f":"IF(SortSheet!K10=\"\",\"\",SortSheet!K10)","v":""},"</td><td>",{"$f":"IF(SortSheet!L10=\"\",\"\",SortSheet!L10)","v":""},"</td><td class='Bld'>",{"$f":"IF(SortSheet!M10=0,\"\",SortSheet!M10)","v":""},"</td>###<td class='Bld'>",{"$f":"IF(SortSheet!N10=0,\"\",SortSheet!N10)","v":""},"</td>###</tr>"]
["<tr align=\"center\">###<td class=\"Bld\">",{"$f":"IF(SortSheet!B11=\"\",\"\",SortSheet!B11)","v":""},"</td>###<td>",{"$f":"IF(SortSheet!$B11=\"\",\"\",CONCATENATE(SortSheet!$D11,\" \",SortSheet!$E11,\", \",SortSheet!$F11))","v":""},"</td>###<td>",{"$f":"IF(SortSheet!G11=\"\",\"\",SortSheet!G11)","v":""},"</td><td>",{"$f":"IF(SortSheet!H11=\"\",\"\",SortSheet!H11)","v":""},"</td><td>",{"$f":"IF(SortSheet!I11=\"\",\"\",SortSheet!I11)","v":""},"</td><td>",{"$f":"IF(SortSheet!J11=\"\",\"\",SortSheet!J11)","v":""},"</td><td>",{"$f":"IF(SortSheet!K11=\"\",\"\",SortSheet!K11)","v":""},"</td><td>",{"$f":"IF(SortSheet!L11=\"\",\"\",SortSheet!L11)","v":""},"</td><td class='Bld'>",{"$f":"IF(SortSheet!M11=0,\"\",SortSheet!M11)","v":""},"</td>###<td class='Bld'>",{"$f":"IF(SortSheet!N11=0,\"\",SortSheet!N11)","v":""},"</td>###</tr>"]
["<tr align=\"center\">###<td class=\"Bld\">",{"$f":"IF(SortSheet!B12=\"\",\"\",SortSheet!B12)","v":""},"</td>###<td>",{"$f":"IF(SortSheet!$B12=\"\",\"\",CONCATENATE(SortSheet!$D12,\" \",SortSheet!$E12,\", \",SortSheet!$F12))","v":""},"</td>###<td>",{"$f":"IF(SortSheet!G12=\"\",\"\",SortSheet!G12)","v":""},"</td><td>",{"$f":"IF(SortSheet!H12=\"\",\"\",SortSheet!H12)","v":""},"</td><td>",{"$f":"IF(SortSheet!I12=\"\",\"\",SortSheet!I12)","v":""},"</td><td>",{"$f":"IF(SortSheet!J12=\"\",\"\",SortSheet!J12)","v":""},"</td><td>",{"$f":"IF(SortSheet!K12=\"\",\"\",SortSheet!K12)","v":""},"</td><td>",{"$f":"IF(SortSheet!L12=\"\",\"\",SortSheet!L12)","v":""},"</td><td class='Bld'>",{"$f":"IF(SortSheet!M12=0,\"\",SortSheet!M12)","v":""},"</td>###<td class='Bld'>",{"$f":"IF(SortSheet!N12=0,\"\",SortSheet!N12)","v":""},"</td>###</tr>"]
{"$rows_left_out":55}
{"sheet":"Lists","index":4,"n_rows":44,"n_cols":13,"rows_kept":44,"cut":false,"hidden":true,"merged":[]}
[null,null,"PISTOL",null,null,null,"RIFLE"]
[null,null,"Row Labels",null,null,null,"Row Labels"]
[1,null,"(blank)",null,null,null,"(blank)",null,null,null,"Iron Sights",{"$f":"COUNTIF(Table4[SIGHTS],Lists!K3)+COUNTIF(Table5[SIGHTS],Lists!K3)","v":0}]
[2,null,null,null,null,null,null,null,null,null,"Laser",{"$f":"COUNTIF(Table4[SIGHTS],Lists!K4)+COUNTIF(Table5[SIGHTS],Lists!K4)","v":0}]
[3,null,null,null,null,null,null,null,null,null,"Red Dot",{"$f":"COUNTIF(Table4[SIGHTS],Lists!K5)+COUNTIF(Table5[SIGHTS],Lists!K5)","v":0}]
[4,null,null,null,null,null,null,null,null,null,"Scope",{"$f":"COUNTIF(Table4[SIGHTS],Lists!K6)+COUNTIF(Table5[SIGHTS],Lists!K6)","v":0}]
[5]
[6,null,null,null,null,null,null,null,null,null,"GUNS",{"$f":"SUM(L9:L10)","v":0}]
[7,null,null,null,null,null,null,null,null,null,"PISTOL",{"$f":"COUNTA(Table4[NAME])","v":0}]
[8,null,null,null,null,null,null,null,null,null,"RIFLE",{"$f":"COUNTA(Table5[NAME])","v":0}]
{"$rows_left_out":34}