{"text_format":"1","workbook":"xlsx","n_sheets":5,"sheets":["Semi-Auto","Revolver","SortSheet","HTML","Lists"],"not_rendered":{"charts":0,"images":0,"macros":1,"external_links":1,"defined_names":20,"comments":0,"pivot_tables":2},"unopened":[],"bounds":{"document_bytes":16777216,"sheet_cells":100000,"rows_first":2000,"rows_last":500,"rows_between":2000,"halvings":0,"cell_chars":16384,"cell_head_chars":4096},"cells_cut":0,"cells_raw":0,"read":"whole","date_system":"1900"}

{"sheet":"Semi-Auto","index":0,"n_rows":46,"n_cols":25,"rows_kept":46,"cut":false,"hidden":false,"merged":[[1,9,1,14],[1,5,1,7],[0,7,0,16],[0,17,0,20],[0,24,0,25],[0,5,0,6],[0,21,0,22],[1,15,1,20]]}
[null,null,"Semi-Auto",null,null,"DATE",null,"Country Pond Fish & Game Club\nCENTERFIRE Pin Shoot",null,null,null,null,null,null,null,null,null,"pins_cf.xlsm",null,null,null,{"$f":"LastSaved()","v":"2017-09-15T21:06:04"},null,null,"=LastSaved()"]
[null,null,null,null,{"$f":"SUM($E$5:$E$36)","v":0},"GUN",null,null,"SIGHTS","RELAY 1",null,null,null,null,null,"RELAY 2"]
[]
["#",null,"NAME","CPF&G #","PAID","MANUFACTURER","MODEL","CALIBER","SIGHTS","LN1","SCORE1","LN2","SCORE2","LN3","SCORE3","LN4","SCORE4","LN5","SCORE5","LN6","SCORE6","TOTAL","SHOOTOFF"]
[1,null,null,null,null,null,null,null,null,1,null,2,null,3,null,1,null,2,null,3,null,{"$f":"IF($C5=\"\",0,IF(K5+M5+O5+Q5+S5+U5=0,\"\",K5+M5+O5+Q5+S5+U5))","v":0}]
[2,null,null,null,null,null,null,null,null,2,null,3,null,1,null,2,null,3,null,1,null,0]
[3,null,null,null,null,null,null,null,null,3,null,1,null,2,null,3,null,1,null,2,null,0]
[4,null,null,null,null,null,null,null,null,1,null,2,null,3,null,1,null,2,null,3,null,0]
[5,null,null,null,null,null,null,null,null,2,null,3,null,1,null,2,null,3,null,1,null,0]
[6,null,null,null,null,null,null,null,null,3,null,1,null,2,null,3,null,1,null,2,null,0]
{"$rows_left_out":37}
{"sheet":"Revolver","index":1,"n_rows":43,"n_cols":23,"rows_kept":43,"cut":false,"hidden":false,"merged":[[0,21,0,22],[0,24,0,25],[1,5,1,7],[1,9,1,14],[1,15,1,20],[0,5,0,6],[0,7,0,16],[0,17,0,20]]}
[null,null,"Revolver",null,null,{"$f":"'Semi-Auto'!F1:G1","v":"DATE"},null,"Country Pond Fish & Game Club\nCENTERFIRE Pin Shoot"]
[null,null,null,null,{"$f":"SUM($E$5:$E$36)","v":0},"GUN",null,null,"SIGHTS","RELAY 1",null,null,null,null,null,"RELAY 2"]
[]
["#",null,"NAME","CPF&G #","PAID","MANUFACTURER","MODEL","CALIBER","SIGHTS","LN1","SCORE1","LN2","SCORE2","LN3","SCORE3","LN4","SCORE4","LN5","SCORE5","LN6","SCORE6","TOTAL","SHOOTOFF"]
[1,null,null,null,null,null,null,null,null,1,null,2,null,3,null,1,null,2,null,3,null,{"$f":"IF($C5=\"\",0,IF(K5+M5+O5+Q5+S5+U5=0,\"\",K5+M5+O5+Q5+S5+U5))","v":0}]
[2,null,null,null,null,null,null,null,null,2,null,3,null,1,null,2,null,3,null,1,null,0]
[3,null,null,null,null,null,null,null,null,3,null,1,null,2,null,3,null,1,null,2,null,0]
[4,null,null,null,null,null,null,null,null,1,null,2,null,3,null,1,null,2,null,3,null,0]
[5,null,null,null,null,null,null,null,null,2,null,3,null,1,null,2,null,3,null,1,null,0]
[6,null,null,null,null,null,null,null,null,3,null,1,null,2,null,3,null,1,null,2,null,0]
{"$rows_left_out":34}
{"sheet":"SortSheet","index":2,"n_rows":42,"n_cols":31,"rows_kept":42,"cut":false,"hidden":true,"merged":[[0,3,0,9],[0,19,0,25],[1,19,1,22],[1,23,1,25],[1,26,1,28],[1,3,1,6],[1,7,1,9],[1,10,1,12]]}
[null,"SEMI-AUTO",null,"Sort by Column O (A to Z) then by Column N (Large too Small)",null,null,null,null,null,null,null,null,null,null,null,null,null,"REVOLVER",null,"Sort by Column AE (A to Z) then by Column AD (Large too Small)"]
[null,null,null,"GUN",null,null,null,"RELAY 1",null,null,"RELAY 2",null,null,null,null,null,null,null,null,"GUN",null,null,null,"RELAY 1",null,null,"RELAY 2"]
["#","SHOOTER","CPF&G #","MFR","MODEL","CALIBER","SIGHTS","1-1","1-2","1-3","2-1","2-2","2-3","SCORE","SHOOT OFF",null,"#","SHOOTER","CPF&G #","MFR","MODEL","CALIBER","SIGHTS","1-1","1-2","1-3","2-1","2-2","2-3","SCORE","SHOOT OFF"]
[1,{"$f":"IF('Semi-Auto'!$C5=\"\",\"\",'Semi-Auto'!C5)","v":""},{"$f":"IF('Semi-Auto'!$D5=\"\",\"\",'Semi-Auto'!D5)","v":""},{"$f":"IF('Semi-Auto'!$C5=\"\",\"\",'Semi-Auto'!F5)","v":""},{"$f":"IF('Semi-Auto'!$C5=\"\",\"\",'Semi-Auto'!G5)","v":""},{"$f":"IF('Semi-Auto'!$C5=\"\",\"\",'Semi-Auto'!H5)","v":""},{"$f":"IF('Semi-Auto'!$C5=\"\",\"\",'Semi-Auto'!I5)","v":""},{"$f":"IF('Semi-Auto'!$C5=\"\",\"\",'Semi-Auto'!K5)","v":""},{"$f":"IF('Semi-Auto'!$C5=\"\",\"\",'Semi-Auto'!M5)","v":""},{"$f":"IF('Semi-Auto'!$C5=\"\",\"\",'Semi-Auto'!O5)","v":""},{"$f":"IF('Semi-Auto'!$C5=\"\",\"\",'Semi-Auto'!Q5)","v":""},{"$f":"IF('Semi-Auto'!$C5=\"\",\"\",'Semi-Auto'!S5)","v":""},{"$f":"IF('Semi-Auto'!$C5=\"\",\"\",'Semi-Auto'!U5)","v":""},{"$f":"IF($B4=\"\",0,'Semi-Auto'!V5)","v":0},{"$f":"IF('Semi-Auto'!W5=\"\",\"\",'Semi-Auto'!W5)","v":""},null,1,{"$f":"IF(tblRevolver=\"\",\"\",tblRevolver)","v":""},{"$f":"IF(Revolver!D5=\"\",\"\",Revolver!D5)","v":""},{"$f":"IF(Revolver!F5=\"\",\"\",Revolver!F5)","v":""},{"$f":"IF(Revolver!G5=\"\",\"\",Revolver!G5)","v":""},{"$f":"IF(Revolver!H5=\"\",\"\",Revolver!H5)","v":""},{"$f":"IF(Revolver!I5=\"\",\"\",Revolver!I5)","v":""},{"$f":"IF(Revolver!K5=\"\",\"\",Revolver!K5)","v":""},{"$f":"IF(Revolver!M5=\"\",\"\",Revolver!M5)","v":""},{"$f":"IF(Revolver!O5=\"\",\"\",Revolver!O5)","v":""},{"$f":"IF(Revolver!Q5=\"\",\"\",Revolver!Q5)","v":""},{"$f":"IF(Revolver!S5=\"\",\"\",Revolver!S5)","v":""},{"$f":"IF(Revolver!U5=\"\",\"\",Revolver!U5)","v":""},{"$f":"IF(Revolver!V5=\"\",\"\",Revolver!V5)","v":0},{"$f":"IF(Revolver!W5=\"\",\"\",Revolver!W5)","v":""}]
[2,{"$f":"IF('Semi-Auto'!$C6=\"\",\"\",'Semi-Auto'!C6)","v":""},{"$f":"IF('Semi-Auto'!$D6=\"\",\"\",'Semi-Auto'!D6)","v":""},{"$f":"IF('Semi-Auto'!$C6=\"\",\"\",'Semi-Auto'!F6)","v":""},{"$f":"IF('Semi-Auto'!$C6=\"\",\"\",'Semi-Auto'!G6)","v":""},{"$f":"IF('Semi-Auto'!$C6=\"\",\"\",'Semi-Auto'!H6)","v":""},{"$f":"IF('Semi-Auto'!$C6=\"\",\"\",'Semi-Auto'!I6)","v":""},{"$f":"IF('Semi-Auto'!$C6=\"\",\"\",'Semi-Auto'!K6)","v":""},{"$f":"IF('Semi-Auto'!$C6=\"\",\"\",'Semi-Auto'!M6)","v":""},{"$f":"IF('Semi-Auto'!$C6=\"\",\"\",'Semi-Auto'!O6)","v":""},{"$f":"IF('Semi-Auto'!$C6=\"\",\"\",'Semi-Auto'!Q6)","v":""},{"$f":"IF('Semi-Auto'!$C6=\"\",\"\",'Semi-Auto'!S6)","v":""},{"$f":"IF('Semi-Auto'!$C6=\"\",\"\",'Semi-Auto'!U6)","v":""},{"$f":"IF($B5=\"\",0,'Semi-Auto'!V6)","v":0},{"$f":"IF('Semi-Auto'!W6=\"\",\"\",'Semi-Auto'!W6)","v":""},null,2,"",{"$f":"IF(Revolver!D6=\"\",\"\",Revolver!D6)","v":""},{"$f":"IF(Revolver!F6=\"\",\"\",Revolver!F6)","v":""},{"$f":"IF(Revolver!G6=\"\",\"\",Revolver!G6)","v":""},{"$f":"IF(Revolver!H6=\"\",\"\",Revolver!H6)","v":""},{"$f":"IF(Revolver!I6=\"\",\"\",Revolver!I6)","v":""},{"$f":"IF(Revolver!K6=\"\",\"\",Revolver!K6)","v":""},{"$f":"IF(Revolver!M6=\"\",\"\",Revolver!M6)","v":""},{"$f":"IF(Revolver!O6=\"\",\"\",Revolver!O6)","v":""},{"$f":"IF(Revolver!Q6=\"\",\"\",Revolver!Q6)","v":""},{"$f":"IF(Revolver!S6=\"\",\"\",Revolver!S6)","v":""},{"$f":"IF(Revolver!U6=\"\",\"\",Revolver!U6)","v":""},{"$f":"IF(Revolver!V6=\"\",\"\",Revolver!V6)","v":0},{"$f":"IF(Revolver!W6=\"\",\"\",Revolver!W6)","v":""}]
[3,{"$f":"IF('Semi-Auto'!$C7=\"\",\"\",'Semi-Auto'!C7)","v":""},{"$f":"IF('Semi-Auto'!$D7=\"\",\"\",'Semi-Auto'!D7)","v":""},{"$f":"IF('Semi-Auto'!$C7=\"\",\"\",'Semi-Auto'!F7)","v":""},{"$f":"IF('Semi-Auto'!$C7=\"\",\"\",'Semi-Auto'!G7)","v":""},{"$f":"IF('Semi-Auto'!$C7=\"\",\"\",'Semi-Auto'!H7)","v":""},{"$f":"IF('Semi-Auto'!$C7=\"\",\"\",'Semi-Auto'!I7)","v":""},{"$f":"IF('Semi-Auto'!$C7=\"\",\"\",'Semi-Auto'!K7)","v":""},{"$f":"IF('Semi-Auto'!$C7=\"\",\"\",'Semi-Auto'!M7)","v":""},{"$f":"IF('Semi-Auto'!$C7=\"\",\"\",'Semi-Auto'!O7)","v":""},{"$f":"IF('Semi-Auto'!$C7=\"\",\"\",'Semi-Auto'!Q7)","v":""},{"$f":"IF('Semi-Auto'!$C7=\"\",\"\",'Semi-Auto'!S7)","v":""},{"$f":"IF('Semi-Auto'!$C7=\"\",\"\",'Semi-Auto'!U7)","v":""},{"$f":"IF($B6=\"\",0,'Semi-Auto'!V7)","v":0},{"$f":"IF('Semi-Auto'!W7=\"\",\"\",'Semi-Auto'!W7)","v":""},null,3,"",{"$f":"IF(Revolver!D7=\"\",\"\",Revolver!D7)","v":""},{"$f":"IF(Revolver!F7=\"\",\"\",Revolver!F7)","v":""},{"$f":"IF(Revolver!G7=\"\",\"\",Revolver!G7)","v":""},{"$f":"IF(Revolver!H7=\"\",\"\",Revolver!H7)","v":""},{"$f":"IF(Revolver!I7=\"\",\"\",Revolver!I7)","v":""},{"$f":"IF(Revolver!K7=\"\",\"\",Revolver!K7)","v":""},{"$f":"IF(Revolver!M7=\"\",\"\",Revolver!M7)","v":""},{"$f":"IF(Revolver!O7=\"\",\"\",Revolver!O7)","v":""},{"$f":"IF(Revolver!Q7=\"\",\"\",Revolver!Q7)","v":""},{"$f":"IF(Revolver!S7=\"\",\"\",Revolver!S7)","v":""},{"$f":"IF(Revolver!U7=\"\",\"\",Revolver!U7)","v":""},{"$f":"IF(Revolver!V7=\"\",\"\",Revolver!V7)","v":0},{"$f":"IF(Revolver!W7=\"\",\"\",Revolver!W7)","v":""}]
[4,{"$f":"IF('Semi-Auto'!$C8=\"\",\"\",'Semi-Auto'!C8)","v":""},{"$f":"IF('Semi-Auto'!$D8=\"\",\"\",'Semi-Auto'!D8)","v":""},{"$f":"IF('Semi-Auto'!$C8=\"\",\"\",'Semi-Auto'!F8)","v":""},{"$f":"IF('Semi-Auto'!$C8=\"\",\"\",'Semi-Auto'!G8)","v":""},{"$f":"IF('Semi-Auto'!$C8=\"\",\"\",'Semi-Auto'!H8)","v":""},{"$f":"IF('Semi-Auto'!$C8=\"\",\"\",'Semi-Auto'!I8)","v":""},{"$f":"IF('Semi-Auto'!$C8=\"\",\"\",'Semi-Auto'!K8)","v":""},{"$f":"IF('Semi-Auto'!$C8=\"\",\"\",'Semi-Auto'!M8)","v":""},{"$f":"IF('Semi-Auto'!$C8=\"\",\"\",'Semi-Auto'!O8)","v":""},{"$f":"IF('Semi-Auto'!$C8=\"\",\"\",'Semi-Auto'!Q8)","v":""},{"$f":"IF('Semi-Auto'!$C8=\"\",\"\",'Semi-Auto'!S8)","v":""},{"$f":"IF('Semi-Auto'!$C8=\"\",\"\",'Semi-Auto'!U8)","v":""},{"$f":"IF($B7=\"\",0,'Semi-Auto'!V8)","v":0},{"$f":"IF('Semi-Auto'!W8=\"\",\"\",'Semi-Auto'!W8)","v":""},null,4,"",{"$f":"IF(Revolver!D8=\"\",\"\",Revolver!D8)","v":""},{"$f":"IF(Revolver!F8=\"\",\"\",Revolver!F8)","v":""},{"$f":"IF(Revolver!G8=\"\",\"\",Revolver!G8)","v":""},{"$f":"IF(Revolver!H8=\"\",\"\",Revolver!H8)","v":""},{"$f":"IF(Revolver!I8=\"\",\"\",Revolver!I8)","v":""},{"$f":"IF(Revolver!K8=\"\",\"\",Revolver!K8)","v":""},{"$f":"IF(Revolver!M8=\"\",\"\",Revolver!M8)","v":""},{"$f":"IF(Revolver!O8=\"\",\"\",Revolver!O8)","v":""},{"$f":"IF(Revolver!Q8=\"\",\"\",Revolver!Q8)","v":""},{"$f":"IF(Revolver!S8=\"\",\"\",Revolver!S8)","v":""},{"$f":"IF(Revolver!U8=\"\",\"\",Revolver!U8)","v":""},{"$f":"IF(Revolver!V8=\"\",\"\",Revolver!V8)","v":0},{"$f":"IF(Revolver!W8=\"\",\"\",Revolver!W8)","v":""}]
[5,{"$f":"IF('Semi-Auto'!$C9=\"\",\"\",'Semi-Auto'!C9)","v":""},{"$f":"IF('Semi-Auto'!$D9=\"\",\"\",'Semi-Auto'!D9)","v":""},{"$f":"IF('Semi-Auto'!$C9=\"\",\"\",'Semi-Auto'!F9)","v":""},{"$f":"IF('Semi-Auto'!$C9=\"\",\"\",'Semi-Auto'!G9)","v":""},{"$f":"IF('Semi-Auto'!$C9=\"\",\"\",'Semi-Auto'!H9)","v":""},{"$f":"IF('Semi-Auto'!$C9=\"\",\"\",'Semi-Auto'!I9)","v":""},{"$f":"IF('Semi-Auto'!$C9=\"\",\"\",'Semi-Auto'!K9)","v":""},{"$f":"IF('Semi-Auto'!$C9=\"\",\"\",'Semi-Auto'!M9)","v":""},{"$f":"IF('Semi-Auto'!$C9=\"\",\"\",'Semi-Auto'!O9)","v":""},{"$f":"IF('Semi-Auto'!$C9=\"\",\"\",'Semi-Auto'!Q9)","v":""},{"$f":"IF('Semi-Auto'!$C9=\"\",\"\",'Semi-Auto'!S9)","v":""},{"$f":"IF('Semi-Auto'!$C9=\"\",\"\",'Semi-Auto'!U9)","v":""},{"$f":"IF($B8=\"\",0,'Semi-Auto'!V9)","v":0},{"$f":"IF('Semi-Auto'!W9=\"\",\"\",'Semi-Auto'!W9)","v":""},null,5,"",{"$f":"IF(Revolver!D9=\"\",\"\",Revolver!D9)","v":""},{"$f":"IF(Revolver!F9=\"\",\"\",Revolver!F9)","v":""},{"$f":"IF(Revolver!G9=\"\",\"\",Revolver!G9)","v":""},{"$f":"IF(Revolver!H9=\"\",\"\",Revolver!H9)","v":""},{"$f":"IF(Revolver!I9=\"\",\"\",Revolver!I9)","v":""},{"$f":"IF(Revolver!K9=\"\",\"\",Revolver!K9)","v":""},{"$f":"IF(Revolver!M9=\"\",\"\",Revolver!M9)","v":""},{"$f":"IF(Revolver!O9=\"\",\"\",Revolver!O9)","v":""},{"$f":"IF(Revolver!Q9=\"\",\"\",Revolver!Q9)","v":""},{"$f":"IF(Revolver!S9=\"\",\"\",Revolver!S9)","v":""},{"$f":"IF(Revolver!U9=\"\",\"\",Revolver!U9)","v":""},{"$f":"IF(Revolver!V9=\"\",\"\",Revolver!V9)","v":0},{"$f":"IF(Revolver!W9=\"\",\"\",Revolver!W9)","v":""}]
[6,{"$f":"IF('Semi-Auto'!$C10=\"\",\"\",'Semi-Auto'!C10)","v":""},{"$f":"IF('Semi-Auto'!$D10=\"\",\"\",'Semi-Auto'!D10)","v":""},{"$f":"IF('Semi-Auto'!$C10=\"\",\"\",'Semi-Auto'!F10)","v":""},{"$f":"IF('Semi-Auto'!$C10=\"\",\"\",'Semi-Auto'!G10)","v":""},{"$f":"IF('Semi-Auto'!$C10=\"\",\"\",'Semi-Auto'!H10)","v":""},{"$f":"IF('Semi-Auto'!$C10=\"\",\"\",'Semi-Auto'!I10)","v":""},{"$f":"IF('Semi-Auto'!$C10=\"\",\"\",'Semi-Auto'!K10)","v":""},{"$f":"IF('Semi-Auto'!$C10=\"\",\"\",'Semi-Auto'!M10)","v":""},{"$f":"IF('Semi-Auto'!$C10=\"\",\"\",'Semi-Auto'!O10)","v":""},{"$f":"IF('Semi-Auto'!$C10=\"\",\"\",'Semi-Auto'!Q10)","v":""},{"$f":"IF('Semi-Auto'!$C10=\"\",\"\",'Semi-Auto'!S10)","v":""},{"$f":"IF('Semi-Auto'!$C10=\"\",\"\",'Semi-Auto'!U10)","v":""},{"$f":"IF($B9=\"\",0,'Semi-Auto'!V10)","v":0},{"$f":"IF('Semi-Auto'!W10=\"\",\"\",'Semi-Auto'!W10)","v":""},null,6,"",{"$f":"IF(Revolver!D10=\"\",\"\",Revolver!D10)","v":""},{"$f":"IF(Revolver!F10=\"\",\"\",Revolver!F10)","v":""},{"$f":"IF(Revolver!G10=\"\",\"\",Revolver!G10)","v":""},{"$f":"IF(Revolver!H10=\"\",\"\",Revolver!H10)","v":""},{"$f":"IF(Revolver!I10=\"\",\"\",Revolver!I10)","v":""},{"$f":"IF(Revolver!K10=\"\",\"\",Revolver!K10)","v":""},{"$f":"IF(Revolver!M10=\"\",\"\",Revolver!M10)","v":""},{"$f":"IF(Revolver!O10=\"\",\"\",Revolver!O10)","v":""},{"$f":"IF(Revolver!Q10=\"\",\"\",Revolver!Q10)","v":""},{"$f":"IF(Revolver!S10=\"\",\"\",Revolver!S10)","v":""},{"$f":"IF(Revolver!U10=\"\",\"\",Revolver!U10)","v":""},{"$f":"IF(Revolver!V10=\"\",\"\",Revolver!V10)","v":0},{"$f":"IF(Revolver!W10=\"\",\"\",Revolver!W10)","v":""}]
[7,{"$f":"IF('Semi-Auto'!$C11=\"\",\"\",'Semi-Auto'!C11)","v":""},{"$f":"IF('Semi-Auto'!$D11=\"\",\"\",'Semi-Auto'!D11)","v":""},{"$f":"IF('Semi-Auto'!$C11=\"\",\"\",'Semi-Auto'!F11)","v":""},{"$f":"IF('Semi-Auto'!$C11=\"\",\"\",'Semi-Auto'!G11)","v":""},{"$f":"IF('Semi-Auto'!$C11=\"\",\"\",'Semi-Auto'!H11)","v":""},{"$f":"IF('Semi-Auto'!$C11=\"\",\"\",'Semi-Auto'!I11)","v":""},{"$f":"IF('Semi-Auto'!$C11=\"\",\"\",'Semi-Auto'!K11)","v":""},{"$f":"IF('Semi-Auto'!$C11=\"\",\"\",'Semi-Auto'!M11)","v":""},{"$f":"IF('Semi-Auto'!$C11=\"\",\"\",'Semi-Auto'!O11)","v":""},{"$f":"IF('Semi-Auto'!$C11=\"\",\"\",'Semi-Auto'!Q11)","v":""},{"$f":"IF('Semi-Auto'!$C11=\"\",\"\",'Semi-Auto'!S11)","v":""},{"$f":"IF('Semi-Auto'!$C11=\"\",\"\",'Semi-Auto'!U11)","v":""},{"$f":"IF($B10=\"\",0,'Semi-Auto'!V11)","v":0},{"$f":"IF('Semi-Auto'!W11=\"\",\"\",'Semi-Auto'!W11)","v":""},null,7,"",{"$f":"IF(Revolver!D11=\"\",\"\",Revolver!D11)","v":""},{"$f":"IF(Revolver!F11=\"\",\"\",Revolver!F11)","v":""},{"$f":"IF(Revolver!G11=\"\",\"\",Revolver!G11)","v":""},{"$f":"IF(Revolver!H11=\"\",\"\",Revolver!H11)","v":""},{"$f":"IF(Revolver!I11=\"\",\"\",Revolver!I11)","v":""},{"$f":"IF(Revolver!K11=\"\",\"\",Revolver!K11)","v":""},{"$f":"IF(Revolver!M11=\"\",\"\",Revolver!M11)","v":""},{"$f":"IF(Revolver!O11=\"\",\"\",Revolver!O11)","v":""},{"$f":"IF(Revolver!Q11=\"\",\"\",Revolver!Q11)","v":""},{"$f":"IF(Revolver!S11=\"\",\"\",Revolver!S11)","v":""},{"$f":"IF(Revolver!U11=\"\",\"\",Revolver!U11)","v":""},{"$f":"IF(Revolver!V11=\"\",\"\",Revolver!V11)","v":0},{"$f":"IF(Revolver!W11=\"\",\"\",Revolver!W11)","v":""}]
{"$rows_left_out":33}
{"sheet":"HTML","index":3,"n_rows":83,"n_cols":21,"rows_kept":83,"cut":false,"hidden":true,"merged":[[0,17,0,18]]}
[{"$f":"'Semi-Auto'!F1","v":"DATE"}]
[null,"NAME",null,"GUN",null,1,null,2,null,3,null,4,null,5,null,6,null,"TTL",null,"SHOOTOFF"]
["SEMI-AUTO"]
["<tr align=\"center\">###<td class=\"Bld\">",{"$f":"IF(SortSheet!B4=\"\",\"\",SortSheet!B4)","v":""},"</td>###<td>",{"$f":"IF(SortSheet!$D4=\"\",\"\",CONCATENATE(SortSheet!$D4,\" \",SortSheet!$E4,\", \",SortSheet!$F4,\", \",SortSheet!$G4))","v":""},{"$f":"IF(F4=5,\"</td>###<td class='ClnPos'>\",\"</td>###<td>\")","v":"</td>###<td>"},{"$f":"IF(SortSheet!H4=\"\",\"\",SortSheet!H4)","v":""},{"$f":"IF(H4=5,\"</td><td class='ClnPos'>\",\"</td><td>\")","v":"</td><td>"},{"$f":"IF(SortSheet!I4=\"\",\"\",SortSheet!I4)","v":""},{"$f":"IF(J4=5,\"</td><td class='ClnPos'>\",\"</td><td>\")","v":"</td><td>"},{"$f":"IF(SortSheet!J4=\"\",\"\",SortSheet!J4)","v":""},{"$f":"IF(L4=5,\"</td><td class='ClnPos'>\",\"</td><td>\")","v":"</td><td>"},{"$f":"IF(SortSheet!K4=\"\",\"\",SortSheet!K4)","v":""},{"$f":"IF(N4=5,\"</td><td class='ClnPos'>\",\"</td><td>\")","v":"</td><td>"},{"$f":"IF(SortSheet!L4=\"\",\"\",SortSheet!L4)","v":""},{"$f":"IF(P4=5,\"</td><td class='ClnPos'>\",\"</td><td>\")","v":"</td><td>"},{"$f":"IF(SortSheet!M4=\"\",\"\",SortSheet!M4)","v":""},{"$f":"IF(R4=30,\"</td><A1>\",\"</td><td class='Bld'>\")","v":"</td><td class='Bld'>"},{"$f":"IF(SortSheet!N4=\"\",\"\",SortSheet!N4)","v":0},"</td>###<td class='Bld'>",{"$f":"IF(SortSheet!O4=0,\"\",SortSheet!O4)","v":""},"</td>###</tr>"]
["<tr align=\"center\">###<td class=\"Bld\">",{"$f":"IF(SortSheet!B5=\"\",\"\",SortSheet!B5)","v":""},"</td>###<td>",{"$f":"IF(SortSheet!$D5=\"\",\"\",CONCATENATE(SortSheet!$D5,\" \",SortSheet!$E5,\", \",SortSheet!$F5,\", \",SortSheet!$G5))","v":""},{"$f":"IF(F5=5,\"</td>###<td class='ClnPos'>\",\"</td>###<td>\")","v":"</td>###<td>"},{"$f":"IF(SortSheet!H5=\"\",\"\",SortSheet!H5)","v":""},{"$f":"IF(H5=5,\"</td><td class='ClnPos'>\",\"</td><td>\")","v":"</td><td>"},{"$f":"IF(SortSheet!I5=\"\",\"\",SortSheet!I5)","v":""},{"$f":"IF(J5=5,\"</td><td class='ClnPos'>\",\"</td><td>\")","v":"</td><td>"},{"$f":"IF(SortSheet!J5=\"\",\"\",SortSheet!J5)","v":""},{"$f":"IF(L5=5,\"</td><td class='ClnPos'>\",\"</td><td>\")","v":"</td><td>"},{"$f":"IF(SortSheet!K5=\"\",\"\",SortSheet!K5)","v":""},{"$f":"IF(N5=5,\"</td><td class='ClnPos'>\",\"</td><td>\")","v":"</td><td>"},{"$f":"IF(SortSheet!L5=\"\",\"\",SortSheet!L5)","v":""},{"$f":"IF(P5=5,\"</td><td class='ClnPos'>\",\"</td><td>\")","v":"</td><td>"},{"$f":"IF(SortSheet!M5=\"\",\"\",SortSheet!M5)","v":""},{"$f":"IF(R5=30,\"</td><td class='ClnMatch'>\",\"</td><td class='Bld'>\")","v":"</td><td class='Bld'>"},{"$f":"IF(SortSheet!N5=\"\",\"\",SortSheet!N5)","v":0},"</td>###<td class='Bld'>",{"$f":"IF(SortSheet!O5=0,\"\",SortSheet!O5)","v":""},"</td>###</tr>"]
["<tr align=\"center\">###<td class=\"Bld\">",{"$f":"IF(SortSheet!B6=\"\",\"\",SortSheet!B6)","v":""},"</td>###<td>",{"$f":"IF(SortSheet!$D6=\"\",\"\",CONCATENATE(SortSheet!$D6,\" \",SortSheet!$E6,\", \",SortSheet!$F6,\", \",SortSheet!$G6))","v":""},"</td>###<td>",{"$f":"IF(SortSheet!H6=\"\",\"\",SortSheet!H6)","v":""},"</td><td>",{"$f":"IF(SortSheet!I6=\"\",\"\",SortSheet!I6)","v":""},"</td><td>",{"$f":"IF(SortSheet!J6=\"\",\"\",SortSheet!J6)","v":""},"</td><td>",{"$f":"IF(SortSheet!K6=\"\",\"\",SortSheet!K6)","v":""},"</td><td>",{"$f":"IF(SortSheet!L6=\"\",\"\",SortSheet!L6)","v":""},"</td><td>",{"$f":"IF(SortSheet!M6=\"\",\"\",SortSheet!M6)","v":""},"</td><td class='Bld'>",{"$f":"IF(SortSheet!N6=\"\",\"\",SortSheet!N6)","v":0},"</td>###<td class='Bld'>",{"$f":"IF(SortSheet!O6=0,\"\",SortSheet!O6)","v":""},"</td>###</tr>"]
["<tr align=\"center\">###<td class=\"Bld\">",{"$f":"IF(SortSheet!B7=\"\",\"\",SortSheet!B7)","v":""},"</td>###<td>",{"$f":"IF(SortSheet!$D7=\"\",\"\",CONCATENATE(SortSheet!$D7,\" \",SortSheet!$E7,\", \",SortSheet!$F7,\", \",SortSheet!$G7))","v":""},"</td>###<td>",{"$f":"IF(SortSheet!H7=\"\",\"\",SortSheet!H7)","v":""},"</td><td>",{"$f":"IF(SortSheet!I7=\"\",\"\",SortSheet!I7)","v":""},"</td><td>",{"$f":"IF(SortSheet!J7=\"\",\"\",SortSheet!J7)","v":""},"</td><td>",{"$f":"IF(SortSheet!K7=\"\",\"\",SortSheet!K7)","v":""},"</td><td>",{"$f":"IF(SortSheet!L7=\"\",\"\",SortSheet!L7)","v":""},"</td><td>",{"$f":"IF(SortSheet!M7=\"\",\"\",SortSheet!M7)","v":""},"</td><td class='Bld'>",{"$f":"IF(SortSheet!N7=\"\",\"\",SortSheet!N7)","v":0},"</td>###<td class='Bld'>",{"$f":"IF(SortSheet!O7=0,\"\",SortSheet!O7)","v":""},"</td>###</tr>"]
["<tr align=\"center\">###<td class=\"Bld\">",{"$f":"IF(SortSheet!B8=\"\",\"\",SortSheet!B8)","v":""},"</td>###<td>",{"$f":"IF(SortSheet!$D8=\"\",\"\",CONCATENATE(SortSheet!$D8,\" \",SortSheet!$E8,\", \",SortSheet!$F8,\", \",SortSheet!$G8))","v":""},"</td>###<td>",{"$f":"IF(SortSheet!H8=\"\",\"\",SortSheet!H8)","v":""},"</td><td>",{"$f":"IF(SortSheet!I8=\"\",\"\",SortSheet!I8)","v":""},"</td><td>",{"$f":"IF(SortSheet!J8=\"\",\"\",SortSheet!J8)","v":""},"</td><td>",{"$f":"IF(SortSheet!K8=\"\",\"\",SortSheet!K8)","v":""},"</td><td>",{"$f":"IF(SortSheet!L8=\"\",\"\",SortSheet!L8)","v":""},"</td><td>",{"$f":"IF(SortSheet!M8=\"\",\"\",SortSheet!M8)","v":""},"</td><td class='Bld'>",{"$f":"IF(SortSheet!N8=\"\",\"\",SortSheet!N8)","v":0},"</td>###<td class='Bld'>",{"$f":"IF(SortSheet!O8=0,\"\",SortSheet!O8)","v":""},"</td>###</tr>"]
["<tr align=\"center\">###<td class=\"Bld\">",{"$f":"IF(SortSheet!B9=\"\",\"\",SortSheet!B9)","v":""},"</td>###<td>",{"$f":"IF(SortSheet!$D9=\"\",\"\",CONCATENATE(SortSheet!$D9,\" \",SortSheet!$E9,\", \",SortSheet!$F9,\", \",SortSheet!$G9))","v":""},"</td>###<td>",{"$f":"IF(SortSheet!H9=\"\",\"\",SortSheet!H9)","v":""},"</td><td>",{"$f":"IF(SortSheet!I9=\"\",\"\",SortSheet!I9)","v":""},"</td><td>",{"$f":"IF(SortSheet!J9=\"\",\"\",SortSheet!J9)","v":""},"</td><td>",{"$f":"IF(SortSheet!K9=\"\",\"\",SortSheet!K9)","v":""},"</td><td>",{"$f":"IF(SortSheet!L9=\"\",\"\",SortSheet!L9)","v":""},"</td><td>",{"$f":"IF(SortSheet!M9=\"\",\"\",SortSheet!M9)","v":""},"</td><td class='Bld'>",{"$f":"IF(SortSheet!N9=\"\",\"\",SortSheet!N9)","v":0},"</td>###<td class='Bld'>",{"$f":"IF(SortSheet!O9=0,\"\",SortSheet!O9)","v":""},"</td>###</tr>"]
["<tr align=\"center\">###<td class=\"Bld\">",{"$f":"IF(SortSheet!B10=\"\",\"\",SortSheet!B10)","v":""},"</td>###<td>",{"$f":"IF(SortSheet!$D10=\"\",\"\",CONCATENATE(SortSheet!$D10,\" \",SortSheet!$E10,\", \",SortSheet!$F10,\", \",SortSheet!$G10))","v":""},"</td>###<td>",{"$f":"IF(SortSheet!H10=\"\",\"\",SortSheet!H10)","v":""},"</td><td>",{"$f":"IF(SortSheet!I10=\"\",\"\",SortSheet!I10)","v":""},"</td><td>",{"$f":"IF(SortSheet!J10=\"\",\"\",SortSheet!J10)","v":""},"</td><td>",{"$f":"IF(SortSheet!K10=\"\",\"\",SortSheet!K10)","v":""},"</td><td>",{"$f":"IF(SortSheet!L10=\"\",\"\",SortSheet!L10)","v":""},"</td><td>",{"$f":"IF(SortSheet!M10=\"\",\"\",SortSheet!M10)","v":""},"</td><td class='Bld'>",{"$f":"IF(SortSheet!N10=\"\",\"\",SortSheet!N10)","v":0},"</td>###<td class='Bld'>",{"$f":"IF(SortSheet!O10=0,\"\",SortSheet!O10)","v":""},"</td>###</tr>"]
{"$rows_left_out":74}
{"sheet":"Lists","index":4,"n_rows":44,"n_cols":13,"rows_kept":44,"cut":false,"hidden":true,"merged":[]}
[null,null,"SEMI-AUTO",null,null,null,"REVOLVER"]
[null,null,"Row Labels",null,"CPFGC#",null,"Row Labels",null,"CPFGC#"]
[1,null,"(blank)",null,{"$f":"IFERROR(IF(VLOOKUP(Lists!C3,Table1[[NAME]:[CPF&G '#]],2,FALSE)=\"\",\"\",VLOOKUP(Lists!C3,Table1[[NAME]:[CPF&G '#]],2,FALSE)),\"\")","v":""},null,"(blank)",null,{"$f":"IFERROR(IF(VLOOKUP(Lists!G3,Table15[[NAME]:[CPF&G '#]],2,FALSE)=\"\",\"\",VLOOKUP(Lists!G3,Table15[[NAME]:[CPF&G '#]],2,FALSE)),\"\")","v":""},null,"Iron Sights",{"$f":"COUNTIF(Table1[SIGHTS],Lists!K3)+COUNTIF(Table15[SIGHTS],Lists!K3)","v":0}]
[2,null,"Ed Upton",null,{"$f":"IFERROR(IF(VLOOKUP(Lists!C4,Table1[[NAME]:[CPF&G '#]],2,FALSE)=\"\",\"\",VLOOKUP(Lists!C4,Table1[[NAME]:[CPF&G '#]],2,FALSE)),\"\")","v":""},null,null,null,{"$f":"IFERROR(IF(VLOOKUP(Lists!G4,Table15[[NAME]:[CPF&G '#]],2,FALSE)=\"\",\"\",VLOOKUP(Lists!G4,Table15[[NAME]:[CPF&G '#]],2,FALSE)),\"\")","v":""},null,"Laser",{"$f":"COUNTIF(Table1[SIGHTS],Lists!K4)+COUNTIF(Table15[SIGHTS],Lists!K4)","v":0}]
[3,null,"Kurt Ringleben",null,{"$f":"IFERROR(IF(VLOOKUP(Lists!C5,Table1[[NAME]:[CPF&G '#]],2,FALSE)=\"\",\"\",VLOOKUP(Lists!C5,Table1[[NAME]:[CPF&G '#]],2,FALSE)),\"\")","v":""},null,null,null,{"$f":"IFERROR(IF(VLOOKUP(Lists!G5,Table15[[NAME]:[CPF&G '#]],2,FALSE)=\"\",\"\",VLOOKUP(Lists!G5,Table15[[NAME]:[CPF&G '#]],2,FALSE)),\"\")","v":""},null,"Red Dot",{"$f":"COUNTIF(Table1[SIGHTS],Lists!K5)+COUNTIF(Table15[SIGHTS],Lists!K5)","v":0}]
[4,null,"Brian Whitney",null,{"$f":"IFERROR(IF(VLOOKUP(Lists!C6,Table1[[NAME]:[CPF&G '#]],2,FALSE)=\"\",\"\",VLOOKUP(Lists!C6,Table1[[NAME]:[CPF&G '#]],2,FALSE)),\"\")","v":""},null,null,null,{"$f":"IFERROR(IF(VLOOKUP(Lists!G6,Table15[[NAME]:[CPF&G '#]],2,FALSE)=\"\",\"\",VLOOKUP(Lists!G6,Table15[[NAME]:[CPF&G '#]],2,FALSE)),\"\")","v":""},null,"Scope",{"$f":"COUNTIF(Table1[SIGHTS],Lists!K6)+COUNTIF(Table15[SIGHTS],Lists!K6)","v":0}]
[5,null,"Dan Goodwin",null,{"$f":"IFERROR(IF(VLOOKUP(Lists!C7,Table1[[NAME]:[CPF&G '#]],2,FALSE)=\"\",\"\",VLOOKUP(Lists!C7,Table1[[NAME]:[CPF&G '#]],2,FALSE)),\"\")","v":""},null,null,null,{"$f":"IFERROR(IF(VLOOKUP(Lists!G7,Table15[[NAME]:[CPF&G '#]],2,FALSE)=\"\",\"\",VLOOKUP(Lists!G7,Table15[[NAME]:[CPF&G '#]],2,FALSE)),\"\")","v":""}]
[6,null,"George Aboshar",null,{"$f":"IFERROR(IF(VLOOKUP(Lists!C8,Table1[[NAME]:[CPF&G '#]],2,FALSE)=\"\",\"\",VLOOKUP(Lists!C8,Table1[[NAME]:[CPF&G '#]],2,FALSE)),\"\")","v":""},null,null,null,{"$f":"IFERROR(IF(VLOOKUP(Lists!G8,Table15[[NAME]:[CPF&G '#]],2,FALSE)=\"\",\"\",VLOOKUP(Lists!G8,Table15[[NAME]:[CPF&G '#]],2,FALSE)),\"\")","v":""},null,"GUNS",{"$f":"SUM(L9:L10)","v":0}]
[7,null,"Tim Swisher",null,{"$f":"IFERROR(IF(VLOOKUP(Lists!C9,Table1[[NAME]:[CPF&G '#]],2,FALSE)=\"\",\"\",VLOOKUP(Lists!C9,Table1[[NAME]:[CPF&G '#]],2,FALSE)),\"\")","v":""},null,null,null,{"$f":"IFERROR(IF(VLOOKUP(Lists!G9,Table15[[NAME]:[CPF&G '#]],2,FALSE)=\"\",\"\",VLOOKUP(Lists!G9,Table15[[NAME]:[CPF&G '#]],2,FALSE)),\"\")","v":""},null," SEMI-AUTO",{"$f":"COUNTA(Table1[NAME])","v":0}]
[8,null,"Dominic Stevens",null,{"$f":"IFERROR(IF(VLOOKUP(Lists!C10,Table1[[NAME]:[CPF&G '#]],2,FALSE)=\"\",\"\",VLOOKUP(Lists!C10,Table1[[NAME]:[CPF&G '#]],2,FALSE)),\"\")","v":""},null,null,null,{"$f":"IFERROR(IF(VLOOKUP(Lists!G10,Table15[[NAME]:[CPF&G '#]],2,FALSE)=\"\",\"\",VLOOKUP(Lists!G10,Table15[[NAME]:[CPF&G '#]],2,FALSE)),\"\")","v":""},null," REVOLVER",{"$f":"COUNTA(Table15[NAME])","v":0}]
{"$rows_left_out":34}