{"text_format":"1","workbook":"xlsx","n_sheets":8,"sheets":["Scores","Tag Teams","Head to Head","Sorts","Match HTML","Tag Team HTML","Head-Head HTML","Lists"],"not_rendered":{"charts":0,"images":0,"macros":1,"external_links":2,"defined_names":37,"comments":0,"pivot_tables":1},"unopened":[],"bounds":{"document_bytes":16777216,"sheet_cells":100000,"rows_first":2000,"rows_last":500,"rows_between":2000,"halvings":0,"cell_chars":16384,"cell_head_chars":4096},"cells_cut":0,"cells_raw":0,"read":"whole","date_system":"1900"}

{"sheet":"Scores","index":0,"n_rows":83,"n_cols":49,"rows_kept":83,"cut":false,"hidden":false,"merged":[[0,12,0,17],[1,6,1,11],[1,12,1,17],[0,19,0,23],[0,25,0,29]]}
["CPF&G .22 Plate Shoot",null,null,null,null,null,null,null,null,null,null,null,"DATE",null,null,null,null,null,null,"2017-09-04T10:09:23",null,null,null,null,null,"=lastsaved()"]
[null,null,null,null,{"$f":"SUM(tblScores[PAID])","v":0},null,"RELAY 1",null,null,null,null,null,"RELAY 2",null,null,null,null,null,null,"IB","IH","IL","IP","IS","RB","RH","RL","RP","RS","SB","SH","SL","SP","SS","IB-J","IH-J","IL-J","IP-J","IS-J","RB-J","RH-J","RL-J","RP-J","RS-J","SB-J","SH-J","SL-J","SP-J","SS-J"]
["No","SHOOTER","CPFG#","DIV","PAID","HITS","1-1","1-2","1-3","1-4","1-5","TTL","2-1","2-2","2-3","22-4","2-5","TTL2"]
[1,null,null,null,null,{"$f":"IF(B4=\"\",0,L4+R4)","v":0},null,null,null,null,null,{"$f":"IF($B4=\"\",\"\",SUM(G4:K4))","v":""},null,null,null,null,null,{"$f":"IF($B4=\"\",\"\",SUM(M4:Q4))","v":""}]
[2,null,null,null,null,0,null,null,null,null,null,"",null,null,null,null,null,""]
[3,null,null,null,null,0,null,null,null,null,null,"",null,null,null,null,null,""]
[4,null,null,null,null,0,null,null,null,null,null,"",null,null,null,null,null,""]
[5,null,null,null,null,0,null,null,null,null,null,"",null,null,null,null,null,""]
{"$rows_left_out":76}
{"sheet":"Tag Teams","index":1,"n_rows":31,"n_cols":9,"rows_kept":31,"cut":false,"hidden":false,"merged":[[0,5,0,8]]}
["CPF&G .22 Plate Shoot Tag Teams",null,null,{"$f":"Scores!M1","v":"DATE"},null,"Enter time as minutes <COLON> seconds <DOT> hundredths"]
[]
["MATCH #1",null,null,null,null,null,null,null,"TIME"]
["Team BLUE"]
["Team GREEN"]
["Team RED"]
["Team WHITE"]
[]
{"$rows_left_out":24}
{"sheet":"Head to Head","index":2,"n_rows":22,"n_cols":4,"rows_kept":22,"cut":false,"hidden":false,"merged":[[0,0,0,2]]}
[".22 Plate Shoot - Head to Head Shootoff",null,null,{"$f":"Scores!M1","v":"DATE"}]
[null,"CONTENDER #1","CONTENDER #2","WINNER"]
[1]
[2]
[3]
[4]
[5]
[6]
{"$rows_left_out":15}
{"sheet":"Sorts","index":3,"n_rows":86,"n_cols":16,"rows_kept":86,"cut":false,"hidden":true,"merged":[[2,4,2,9],[2,10,2,15],[0,0,0,1]]}
["SORTS",null,"Sort by \"HITS\" (large to small), then by \"DIV\" (A to Z)"]
[null,"ADD ROWS TO ACCOMMODATE NEW SHOOTERS. DELETE BLANK ROWS BEFORE SORTING."]
[]
["No","SHOOTER","DIV","HITS","1-1","1-2","1-3","1-4","1-5","TTL","2-1","2-2","2-3","22-4","2-5","TTL2"]
[1,{"$f":"IF(Scores!B4=\"\",\"\",Scores!B4)","v":""},{"$f":"IF(Scores!D4=\"\",\"\",Scores!D4)","v":""},{"$f":"IF($B5=\"\",\"\",Scores!F4)","v":""},{"$f":"IF($B5=\"\",\"\",Scores!G4)","v":""},{"$f":"IF($B5=\"\",\"\",Scores!H4)","v":""},{"$f":"IF($B5=\"\",\"\",Scores!I4)","v":""},{"$f":"IF($B5=\"\",\"\",Scores!J4)","v":""},{"$f":"IF($B5=\"\",\"\",Scores!K4)","v":""},{"$f":"IF($B5=\"\",\"\",Scores!L4)","v":""},{"$f":"IF($B5=\"\",\"\",Scores!M4)","v":""},{"$f":"IF($B5=\"\",\"\",Scores!N4)","v":""},{"$f":"IF($B5=\"\",\"\",Scores!O4)","v":""},{"$f":"IF($B5=\"\",\"\",Scores!P4)","v":""},{"$f":"IF($B5=\"\",\"\",Scores!Q4)","v":""},{"$f":"IF($B5=\"\",\"\",Scores!R4)","v":""}]
[2,{"$f":"IF(Scores!B5=\"\",\"\",Scores!B5)","v":""},{"$f":"IF(Scores!D5=\"\",\"\",Scores!D5)","v":""},{"$f":"IF($B6=\"\",\"\",Scores!F5)","v":""},{"$f":"IF($B6=\"\",\"\",Scores!G5)","v":""},{"$f":"IF($B6=\"\",\"\",Scores!H5)","v":""},{"$f":"IF($B6=\"\",\"\",Scores!I5)","v":""},{"$f":"IF($B6=\"\",\"\",Scores!J5)","v":""},{"$f":"IF($B6=\"\",\"\",Scores!K5)","v":""},{"$f":"IF($B6=\"\",\"\",Scores!L5)","v":""},{"$f":"IF($B6=\"\",\"\",Scores!M5)","v":""},{"$f":"IF($B6=\"\",\"\",Scores!N5)","v":""},{"$f":"IF($B6=\"\",\"\",Scores!O5)","v":""},{"$f":"IF($B6=\"\",\"\",Scores!P5)","v":""},{"$f":"IF($B6=\"\",\"\",Scores!Q5)","v":""},{"$f":"IF($B6=\"\",\"\",Scores!R5)","v":""}]
[3,{"$f":"IF(Scores!B6=\"\",\"\",Scores!B6)","v":""},{"$f":"IF(Scores!D6=\"\",\"\",Scores!D6)","v":""},{"$f":"IF($B7=\"\",\"\",Scores!F6)","v":""},{"$f":"IF($B7=\"\",\"\",Scores!G6)","v":""},{"$f":"IF($B7=\"\",\"\",Scores!H6)","v":""},{"$f":"IF($B7=\"\",\"\",Scores!I6)","v":""},{"$f":"IF($B7=\"\",\"\",Scores!J6)","v":""},{"$f":"IF($B7=\"\",\"\",Scores!K6)","v":""},{"$f":"IF($B7=\"\",\"\",Scores!L6)","v":""},{"$f":"IF($B7=\"\",\"\",Scores!M6)","v":""},{"$f":"IF($B7=\"\",\"\",Scores!N6)","v":""},{"$f":"IF($B7=\"\",\"\",Scores!O6)","v":""},{"$f":"IF($B7=\"\",\"\",Scores!P6)","v":""},{"$f":"IF($B7=\"\",\"\",Scores!Q6)","v":""},{"$f":"IF($B7=\"\",\"\",Scores!R6)","v":""}]
[4,{"$f":"IF(Scores!B7=\"\",\"\",Scores!B7)","v":""},{"$f":"IF(Scores!D7=\"\",\"\",Scores!D7)","v":""},{"$f":"IF($B8=\"\",\"\",Scores!F7)","v":""},{"$f":"IF($B8=\"\",\"\",Scores!G7)","v":""},{"$f":"IF($B8=\"\",\"\",Scores!H7)","v":""},{"$f":"IF($B8=\"\",\"\",Scores!I7)","v":""},{"$f":"IF($B8=\"\",\"\",Scores!J7)","v":""},{"$f":"IF($B8=\"\",\"\",Scores!K7)","v":""},{"$f":"IF($B8=\"\",\"\",Scores!L7)","v":""},{"$f":"IF($B8=\"\",\"\",Scores!M7)","v":""},{"$f":"IF($B8=\"\",\"\",Scores!N7)","v":""},{"$f":"IF($B8=\"\",\"\",Scores!O7)","v":""},{"$f":"IF($B8=\"\",\"\",Scores!P7)","v":""},{"$f":"IF($B8=\"\",\"\",Scores!Q7)","v":""},{"$f":"IF($B8=\"\",\"\",Scores!R7)","v":""}]
{"$rows_left_out":79}
{"sheet":"Match HTML","index":4,"n_rows":83,"n_cols":29,"rows_kept":83,"cut":false,"hidden":true,"merged":[[1,5,1,15],[1,17,1,27]]}
[]
[null,null,null,null,null,"ROTATION 1",null,null,null,null,null,null,null,null,null,null,null,"ROTATION 2"]
[null,"NAME",null,"TTL",null,1,null,2,null,3,null,4,null,5,null,"1st",null,1,null,2,null,3,null,4,null,5,null,"1st"]
["<tr align=\"center\">###<td class=\"Bld\">",{"$f":"Sorts!B5","v":""},{"$f":"IF(D4=80,\"</td><td class='ClnMatch'>\",\"</td><td class='Bld'>\")","v":"</td><td class='Bld'>"},{"$f":"Sorts!D5","v":""},{"$f":"IF(F4=8,\"</td>###<td class='ClnPos'>\",\"</td>###<td>\")","v":"</td>###<td>"},{"$f":"Sorts!E5","v":""},{"$f":"IF(H4=8,\"</td><td class='ClnPos'>\",\"</td><td>\")","v":"</td><td>"},{"$f":"Sorts!F5","v":""},{"$f":"IF(J4=8,\"</td><td class='ClnPos'>\",\"</td><td>\")","v":"</td><td>"},{"$f":"Sorts!G5","v":""},{"$f":"IF(L4=8,\"</td><td class='ClnPos'>\",\"</td><td>\")","v":"</td><td>"},{"$f":"Sorts!H5","v":""},{"$f":"IF(N4=8,\"</td><td class='ClnPos'>\",\"</td><td>\")","v":"</td><td>"},{"$f":"Sorts!I5","v":""},{"$f":"IF(P4=40,\"</td><td class='ClnRelay'>\",\"</td><td class='Bld'>\")","v":"</td><td class='Bld'>"},{"$f":"Sorts!J5","v":""},{"$f":"IF(R4=8,\"</td>###<td class='ClnPos'>\",\"</td>###<td>\")","v":"</td>###<td>"},{"$f":"Sorts!K5","v":""},{"$f":"IF(T4=8,\"</td><td class='ClnPos'>\",\"</td><td>\")","v":"</td><td>"},{"$f":"Sorts!L5","v":""},{"$f":"IF(V4=8,\"</td><td class='ClnPos'>\",\"</td><td>\")","v":"</td><td>"},{"$f":"Sorts!M5","v":""},{"$f":"IF(X4=8,\"</td><td class='ClnPos'>\",\"</td><td>\")","v":"</td><td>"},{"$f":"Sorts!N5","v":""},{"$f":"IF(Z4=8,\"</td><td class='ClnPos'>\",\"</td><td>\")","v":"</td><td>"},{"$f":"Sorts!O5","v":""},{"$f":"IF(AB4=40,\"</td><td class='ClnRelay'>\",\"</td><td class='Bld'>\")","v":"</td><td class='Bld'>"},{"$f":"Sorts!P5","v":""},"</td>###</tr>"]
["<tr align=\"center\">###<td class=\"Bld\">",{"$f":"Sorts!B6","v":""},{"$f":"IF(D5=80,\"</td><td class='ClnMatch'>\",\"</td><td class='Bld'>\")","v":"</td><td class='Bld'>"},{"$f":"Sorts!D6","v":""},{"$f":"IF(F5=8,\"</td>###<td class='ClnPos'>\",\"</td>###<td>\")","v":"</td>###<td>"},{"$f":"Sorts!E6","v":""},{"$f":"IF(H5=8,\"</td><td class='ClnPos'>\",\"</td><td>\")","v":"</td><td>"},{"$f":"Sorts!F6","v":""},{"$f":"IF(J5=8,\"</td><td class='ClnPos'>\",\"</td><td>\")","v":"</td><td>"},{"$f":"Sorts!G6","v":""},{"$f":"IF(L5=8,\"</td><td class='ClnPos'>\",\"</td><td>\")","v":"</td><td>"},{"$f":"Sorts!H6","v":""},{"$f":"IF(N5=8,\"</td><td class='ClnPos'>\",\"</td><td>\")","v":"</td><td>"},{"$f":"Sorts!I6","v":""},{"$f":"IF(P5=40,\"</td><td class='ClnRelay'>\",\"</td><td class='Bld'>\")","v":"</td><td class='Bld'>"},{"$f":"Sorts!J6","v":""},{"$f":"IF(R5=8,\"</td>###<td class='ClnPos'>\",\"</td>###<td>\")","v":"</td>###<td>"},{"$f":"Sorts!K6","v":""},{"$f":"IF(T5=8,\"</td><td class='ClnPos'>\",\"</td><td>\")","v":"</td><td>"},{"$f":"Sorts!L6","v":""},{"$f":"IF(V5=8,\"</td><td class='ClnPos'>\",\"</td><td>\")","v":"</td><td>"},{"$f":"Sorts!M6","v":""},{"$f":"IF(X5=8,\"</td><td class='ClnPos'>\",\"</td><td>\")","v":"</td><td>"},{"$f":"Sorts!N6","v":""},{"$f":"IF(Z5=8,\"</td><td class='ClnPos'>\",\"</td><td>\")","v":"</td><td>"},{"$f":"Sorts!O6","v":""},{"$f":"IF(AB5=40,\"</td><td class='ClnRelay'>\",\"</td><td class='Bld'>\")","v":"</td><td class='Bld'>"},{"$f":"Sorts!P6","v":""},"</td>###</tr>"]
["<tr align=\"center\">###<td class=\"Bld\">",{"$f":"Sorts!B7","v":""},"</td><td class='Bld'>",{"$f":"Sorts!D7","v":""},"</td>###<td>",{"$f":"Sorts!E7","v":""},"</td><td>",{"$f":"Sorts!F7","v":""},"</td><td>",{"$f":"Sorts!G7","v":""},"</td><td>",{"$f":"Sorts!H7","v":""},"</td><td>",{"$f":"Sorts!I7","v":""},"</td><td class='Bld'>",{"$f":"Sorts!J7","v":""},"</td>###<td>",{"$f":"Sorts!K7","v":""},"</td><td>",{"$f":"Sorts!L7","v":""},"</td><td>",{"$f":"Sorts!M7","v":""},"</td><td>",{"$f":"Sorts!N7","v":""},"</td><td>",{"$f":"Sorts!O7","v":""},"</td><td class='Bld'>",{"$f":"Sorts!P7","v":""},"</td>###</tr>"]
["<tr align=\"center\">###<td class=\"Bld\">",{"$f":"Sorts!B8","v":""},"</td><td class='Bld'>",{"$f":"Sorts!D8","v":""},"</td>###<td>",{"$f":"Sorts!E8","v":""},"</td><td>",{"$f":"Sorts!F8","v":""},"</td><td>",{"$f":"Sorts!G8","v":""},"</td><td>",{"$f":"Sorts!H8","v":""},"</td><td>",{"$f":"Sorts!I8","v":""},"</td><td class='Bld'>",{"$f":"Sorts!J8","v":""},"</td>###<td>",{"$f":"Sorts!K8","v":""},"</td><td>",{"$f":"Sorts!L8","v":""},"</td><td>",{"$f":"Sorts!M8","v":""},"</td><td>",{"$f":"Sorts!N8","v":""},"</td><td>",{"$f":"Sorts!O8","v":""},"</td><td class='Bld'>",{"$f":"Sorts!P8","v":""},"</td>###</tr>"]
["<tr align=\"center\">###<td class=\"Bld\">",{"$f":"Sorts!B9","v":""},"</td><td class='Bld'>",{"$f":"Sorts!D9","v":""},"</td>###<td>",{"$f":"Sorts!E9","v":""},"</td><td>",{"$f":"Sorts!F9","v":""},"</td><td>",{"$f":"Sorts!G9","v":""},"</td><td>",{"$f":"Sorts!H9","v":""},"</td><td>",{"$f":"Sorts!I9","v":""},"</td><td class='Bld'>",{"$f":"Sorts!J9","v":""},"</td>###<td>",{"$f":"Sorts!K9","v":""},"</td><td>",{"$f":"Sorts!L9","v":""},"</td><td>",{"$f":"Sorts!M9","v":""},"</td><td>",{"$f":"Sorts!N9","v":""},"</td><td>",{"$f":"Sorts!O9","v":""},"</td><td class='Bld'>",{"$f":"Sorts!P9","v":""},"</td>###</tr>"]
{"$rows_left_out":76}
{"sheet":"Tag Team HTML","index":5,"n_rows":29,"n_cols":19,"rows_kept":29,"cut":false,"hidden":true,"merged":[]}
[{"$f":"'Tag Teams'!A3:F3","v":"MATCH #1"}]
[{"$f":"IF(B2=\"Team BLUE\",\"<tr align='center' class='BluTeam'>###<td>\",IF(B2=\"Team GREEN\",\"<tr align='center' class='GrnTeam'>###<td>\",IF(B2=\"Team RED\",\"<tr align='center' class='RedTeam'>###<td>\",IF(B2=\"Team WHITE\",\"<tr align='center' class='WhtTeam'>###<td>\",\"\"))))","v":"<tr align='center' class='BluTeam'>###<td>"},{"$f":"'Tag Teams'!A4","v":"Team BLUE"},"</td>###<td align='left'>",{"$f":"IF('Tag Teams'!B4=\"\",\"\",'Tag Teams'!B4)","v":""},{"$f":"IF('Tag Teams'!C4=\"\",\"\",\",&nbsp;&nbsp;\")","v":""},{"$f":"IF('Tag Teams'!C4=\"\",\"\",'Tag Teams'!C4)","v":""},{"$f":"IF('Tag Teams'!D4=\"\",\"\",\",&nbsp;&nbsp;\")","v":""},{"$f":"IF('Tag Teams'!D4=\"\",\"\",'Tag Teams'!D4)","v":""},{"$f":"IF('Tag Teams'!E4=\"\",\"\",\",&nbsp;&nbsp;\")","v":""},{"$f":"IF('Tag Teams'!E4=\"\",\"\",'Tag Teams'!E4)","v":""},{"$f":"IF('Tag Teams'!F4=\"\",\"\",\",&nbsp;&nbsp;\")","v":""},{"$f":"IF('Tag Teams'!F4=\"\",\"\",'Tag Teams'!F4)","v":""},{"$f":"IF('Tag Teams'!G4=\"\",\"\",\",&nbsp;&nbsp;\")","v":""},{"$f":"IF('Tag Teams'!G4=\"\",\"\",'Tag Teams'!G4)","v":""},{"$f":"IF('Tag Teams'!H4=\"\",\"\",\",&nbsp;&nbsp;\")","v":""},{"$f":"IF('Tag Teams'!H4=\"\",\"\",'Tag Teams'!H4)","v":""},"</td><td>",{"$f":"IF('Tag Teams'!I4=0,\"\",'Tag Teams'!I4)","v":""},"</td>###</tr>"]
[{"$f":"IF(B3=\"Team BLUE\",\"<tr align='center' class='BluTeam'>###<td>\",IF(B3=\"Team GREEN\",\"<tr align='center' class='GrnTeam'>###<td>\",IF(B3=\"Team RED\",\"<tr align='center' class='RedTeam'>###<td>\",IF(B3=\"Team WHITE\",\"<tr align='center' class='WhtTeam'>###<td>\",\"\"))))","v":"<tr align='center' class='GrnTeam'>###<td>"},{"$f":"'Tag Teams'!A5","v":"Team GREEN"},"</td>###<td align='left'>",{"$f":"IF('Tag Teams'!B5=\"\",\"\",'Tag Teams'!B5)","v":""},{"$f":"IF('Tag Teams'!C5=\"\",\"\",\",&nbsp;&nbsp;\")","v":""},{"$f":"IF('Tag Teams'!C5=\"\",\"\",'Tag Teams'!C5)","v":""},{"$f":"IF('Tag Teams'!D5=\"\",\"\",\",&nbsp;&nbsp;\")","v":""},{"$f":"IF('Tag Teams'!D5=\"\",\"\",'Tag Teams'!D5)","v":""},{"$f":"IF('Tag Teams'!E5=\"\",\"\",\",&nbsp;&nbsp;\")","v":""},{"$f":"IF('Tag Teams'!E5=\"\",\"\",'Tag Teams'!E5)","v":""},{"$f":"IF('Tag Teams'!F5=\"\",\"\",\",&nbsp;&nbsp;\")","v":""},{"$f":"IF('Tag Teams'!F5=\"\",\"\",'Tag Teams'!F5)","v":""},{"$f":"IF('Tag Teams'!G5=\"\",\"\",\",&nbsp;&nbsp;\")","v":""},{"$f":"IF('Tag Teams'!G5=\"\",\"\",'Tag Teams'!G5)","v":""},{"$f":"IF('Tag Teams'!H5=\"\",\"\",\",&nbsp;&nbsp;\")","v":""},{"$f":"IF('Tag Teams'!H5=\"\",\"\",'Tag Teams'!H5)","v":""},"</td><td>",{"$f":"IF('Tag Teams'!I5=0,\"\",'Tag Teams'!I5)","v":""},"</td>###</tr>"]
[{"$f":"IF(B4=\"Team BLUE\",\"<tr align='center' class='BluTeam'>###<td>\",IF(B4=\"Team GREEN\",\"<tr align='center' class='GrnTeam'>###<td>\",IF(B4=\"Team RED\",\"<tr align='center' class='RedTeam'>###<td>\",IF(B4=\"Team WHITE\",\"<tr align='center' class='WhtTeam'>###<td>\",\"\"))))","v":"<tr align='center' class='RedTeam'>###<td>"},{"$f":"'Tag Teams'!A6","v":"Team RED"},"</td>###<td align='left'>",{"$f":"IF('Tag Teams'!B6=\"\",\"\",'Tag Teams'!B6)","v":""},{"$f":"IF('Tag Teams'!C6=\"\",\"\",\",&nbsp;&nbsp;\")","v":""},{"$f":"IF('Tag Teams'!C6=\"\",\"\",'Tag Teams'!C6)","v":""},{"$f":"IF('Tag Teams'!D6=\"\",\"\",\",&nbsp;&nbsp;\")","v":""},{"$f":"IF('Tag Teams'!D6=\"\",\"\",'Tag Teams'!D6)","v":""},{"$f":"IF('Tag Teams'!E6=\"\",\"\",\",&nbsp;&nbsp;\")","v":""},{"$f":"IF('Tag Teams'!E6=\"\",\"\",'Tag Teams'!E6)","v":""},{"$f":"IF('Tag Teams'!F6=\"\",\"\",\",&nbsp;&nbsp;\")","v":""},{"$f":"IF('Tag Teams'!F6=\"\",\"\",'Tag Teams'!F6)","v":""},{"$f":"IF('Tag Teams'!G6=\"\",\"\",\",&nbsp;&nbsp;\")","v":""},{"$f":"IF('Tag Teams'!G6=\"\",\"\",'Tag Teams'!G6)","v":""},{"$f":"IF('Tag Teams'!H6=\"\",\"\",\",&nbsp;&nbsp;\")","v":""},{"$f":"IF('Tag Teams'!H6=\"\",\"\",'Tag Teams'!H6)","v":""},"</td><td>",{"$f":"IF('Tag Teams'!I6=0,\"\",'Tag Teams'!I6)","v":""},"</td>###</tr>"]
[{"$f":"IF(B5=\"Team BLUE\",\"<tr align='center' class='BluTeam'>###<td>\",IF(B5=\"Team GREEN\",\"<tr align='center' class='GrnTeam'>###<td>\",IF(B5=\"Team RED\",\"<tr align='center' class='RedTeam'>###<td>\",IF(B5=\"Team WHITE\",\"<tr align='center' class='WhtTeam'>###<td>\",\"\"))))","v":"<tr align='center' class='WhtTeam'>###<td>"},{"$f":"'Tag Teams'!A7","v":"Team WHITE"},"</td>###<td align='left'>",{"$f":"IF('Tag Teams'!B7=\"\",\"\",'Tag Teams'!B7)","v":""},{"$f":"IF('Tag Teams'!C7=\"\",\"\",\",&nbsp;&nbsp;\")","v":""},{"$f":"IF('Tag Teams'!C7=\"\",\"\",'Tag Teams'!C7)","v":""},{"$f":"IF('Tag Teams'!D7=\"\",\"\",\",&nbsp;&nbsp;\")","v":""},{"$f":"IF('Tag Teams'!D7=\"\",\"\",'Tag Teams'!D7)","v":""},{"$f":"IF('Tag Teams'!E7=\"\",\"\",\",&nbsp;&nbsp;\")","v":""},{"$f":"IF('Tag Teams'!E7=\"\",\"\",'Tag Teams'!E7)","v":""},{"$f":"IF('Tag Teams'!F7=\"\",\"\",\",&nbsp;&nbsp;\")","v":""},{"$f":"IF('Tag Teams'!F7=\"\",\"\",'Tag Teams'!F7)","v":""},{"$f":"IF('Tag Teams'!G7=\"\",\"\",\",&nbsp;&nbsp;\")","v":""},{"$f":"IF('Tag Teams'!G7=\"\",\"\",'Tag Teams'!G7)","v":""},{"$f":"IF('Tag Teams'!H7=\"\",\"\",\",&nbsp;&nbsp;\")","v":""},{"$f":"IF('Tag Teams'!H7=\"\",\"\",'Tag Teams'!H7)","v":""},"</td><td>",{"$f":"IF('Tag Teams'!I7=0,\"\",'Tag Teams'!I7)","v":""},"</td>###</tr>"]
[]
[{"$f":"'Tag Teams'!A9:F9","v":"MATCH #2"}]
[{"$f":"IF(B8=\"Team BLUE\",\"<tr align='center' class='BluTeam'>###<td>\",IF(B8=\"Team GREEN\",\"<tr align='center' class='GrnTeam'>###<td>\",IF(B8=\"Team RED\",\"<tr align='center' class='RedTeam'>###<td>\",IF(B8=\"Team WHITE\",\"<tr align='center' class='WhtTeam'>###<td>\",\"\"))))","v":"<tr align='center' class='BluTeam'>###<td>"},{"$f":"'Tag Teams'!A10","v":"Team BLUE"},"</td>###<td align='left'>",{"$f":"IF('Tag Teams'!B10=\"\",\"\",'Tag Teams'!B10)","v":""},{"$f":"IF('Tag Teams'!C10=\"\",\"\",\",&nbsp;&nbsp;\")","v":""},{"$f":"IF('Tag Teams'!C10=\"\",\"\",'Tag Teams'!C10)","v":""},{"$f":"IF('Tag Teams'!D10=\"\",\"\",\",&nbsp;&nbsp;\")","v":""},{"$f":"IF('Tag Teams'!D10=\"\",\"\",'Tag Teams'!D10)","v":""},{"$f":"IF('Tag Teams'!E10=\"\",\"\",\",&nbsp;&nbsp;\")","v":""},{"$f":"IF('Tag Teams'!E10=\"\",\"\",'Tag Teams'!E10)","v":""},{"$f":"IF('Tag Teams'!F10=\"\",\"\",\",&nbsp;&nbsp;\")","v":""},{"$f":"IF('Tag Teams'!F10=\"\",\"\",'Tag Teams'!F10)","v":""},{"$f":"IF('Tag Teams'!G10=\"\",\"\",\",&nbsp;&nbsp;\")","v":""},{"$f":"IF('Tag Teams'!G10=\"\",\"\",'Tag Teams'!G10)","v":""},{"$f":"IF('Tag Teams'!H10=\"\",\"\",\",&nbsp;&nbsp;\")","v":""},{"$f":"IF('Tag Teams'!H10=\"\",\"\",'Tag Teams'!H10)","v":""},"</td><td>",{"$f":"IF('Tag Teams'!I10=0,\"\",'Tag Teams'!I10)","v":""},"</td>###</tr>"]
{"$rows_left_out":22}
{"sheet":"Head-Head HTML","index":6,"n_rows":23,"n_cols":5,"rows_kept":23,"cut":false,"hidden":true,"merged":[]}
[]
["HEAD TO HEAD MATCHUPS"]
[]
["<tr align=\"center\"><td class=\"Bld\">",{"$f":"'Head to Head'!B3&\" vs \"&'Head to Head'!C3","v":" vs "},"</td><td class=\"Bld\">",{"$f":"'Head to Head'!D3","v":0},"</td></tr>"]
["<tr align=\"center\"><td class=\"Bld\">",{"$f":"'Head to Head'!B4&\" vs \"&'Head to Head'!C4","v":" vs "},"</td><td class=\"Bld\">",{"$f":"'Head to Head'!D4","v":0},"</td></tr>"]
["<tr align=\"center\"><td class=\"Bld\">",{"$f":"'Head to Head'!B5&\" vs \"&'Head to Head'!C5","v":" vs "},"</td><td class=\"Bld\">",{"$f":"'Head to Head'!D5","v":0},"</td></tr>"]
["<tr align=\"center\"><td class=\"Bld\">",{"$f":"'Head to Head'!B6&\" vs \"&'Head to Head'!C6","v":" vs "},"</td><td class=\"Bld\">",{"$f":"'Head to Head'!D6","v":0},"</td></tr>"]
["<tr align=\"center\"><td class=\"Bld\">",{"$f":"'Head to Head'!B7&\" vs \"&'Head to Head'!C7","v":" vs "},"</td><td class=\"Bld\">",{"$f":"'Head to Head'!D7","v":0},"</td></tr>"]
{"$rows_left_out":16}
{"sheet":"Lists","index":7,"n_rows":83,"n_cols":11,"rows_kept":83,"cut":false,"hidden":true,"merged":[[2,5,2,6],[0,0,0,3],[0,5,0,6]]}
[".22 PLATE SHOOT",null,null,null,null,{"$f":"Scores!M1","v":"DATE"}]
[]
[null,null,"Row Labels","CPFGC#",null,"GUNS"]
[1,null,"(blank)",null,null,"IB",{"$f":"COUNTIF(tblScores[[SHOOTER]:[DIV]],Lists!F4)","v":0},null,"SHOOTERS",{"$f":"COUNTA($C$4:$C$83)-COUNTIF($C$4:$C$83,\"(blank)\")","v":0}]
[2,null,null,{"$f":"IFERROR(IF(VLOOKUP(C5,tblScores[[SHOOTER]:[CPFG'#]],2,FALSE)=0,\"\",VLOOKUP(C5,tblScores[[SHOOTER]:[CPFG'#]],2,FALSE)),\"\")","v":""},null,"IH",{"$f":"COUNTIF(tblScores[[SHOOTER]:[DIV]],Lists!F5)","v":0},null,"MEMBERS",{"$f":"COUNT(D4:D83)","v":0}]
[3,null,null,{"$f":"IFERROR(IF(VLOOKUP(C6,tblScores[[SHOOTER]:[CPFG'#]],2,FALSE)=0,\"\",VLOOKUP(C6,tblScores[[SHOOTER]:[CPFG'#]],2,FALSE)),\"\")","v":""},null,"IL",{"$f":"COUNTIF(tblScores[[SHOOTER]:[DIV]],Lists!F6)","v":0},null,"NONMEMBERS",{"$f":"J4-J5","v":0}]
[4,null,null,{"$f":"IFERROR(IF(VLOOKUP(C7,tblScores[[SHOOTER]:[CPFG'#]],2,FALSE)=0,\"\",VLOOKUP(C7,tblScores[[SHOOTER]:[CPFG'#]],2,FALSE)),\"\")","v":""},null,"IP",{"$f":"COUNTIF(tblScores[[SHOOTER]:[DIV]],Lists!F7)","v":0}]
[5,null,null,{"$f":"IFERROR(IF(VLOOKUP(C8,tblScores[[SHOOTER]:[CPFG'#]],2,FALSE)=0,\"\",VLOOKUP(C8,tblScores[[SHOOTER]:[CPFG'#]],2,FALSE)),\"\")","v":""},null,"IS",{"$f":"COUNTIF(tblScores[[SHOOTER]:[DIV]],Lists!F8)","v":0},null,"GUNS",{"$f":"SUM($G$4:$G$33)","v":0}]
{"$rows_left_out":75}